program: Gaussian 09
title: 000216102
version: EM64L-G09RevD.01
frameworkgroup: C1[X(C19H24N2O3S)]
method: RPBEPBE
basis: SDD
operation: Freq
keyword: #p
keyword: freq=noraman
keyword: PBEPBE/SDD
title: #p freq=noraman PBEPBE/SDD
converged: NO YES NO NO
title: Mulliken charges:
elementType: S O O O N N C C C C C C C C C C C C C C C C C C C H H H H H H H H H H H H H H H H H H H H H H H H
charge: 0.260217 -0.239957 -0.511546 -0.306549 -0.240594 -0.142038 -0.311837 -0.347617 -0.352048 -0.450293 -0.327591 -0.334923 0.015922 0.210568 0.393228 -0.179867 -0.644593 -0.399064 -0.354283 -0.281776 -0.150925 -0.224829 -0.240164 -0.526592 -0.245926 0.223809 0.216373 0.218932 0.227600 0.247555 0.217321 0.304627 0.215840 0.221619 0.225167 0.236367 0.223588 0.287790 0.235971 0.213978 0.281101 0.259710 0.410471 0.302456 0.238651 0.220586 0.222820 0.256583 0.224156
chargesum: 0.00000
title: Mulliken charges with hydrogens summed into heavy atoms:
elementType: S O O O N N C C C C C C C C C C C C C C C C C C C
charge: 0.260217 -0.239957 -0.101074 -0.306549 -0.240594 -0.142038 0.128346 0.098915 0.112829 0.070175 0.119196 0.125033 0.015922 0.210568 0.393228 -0.179867 0.093146 -0.117963 -0.094572 0.020679 0.087726 -0.004243 -0.017344 -0.270009 -0.021770
polarizability: 2.48228444e+02 4.56108241e+00 2.34230605e+02 -5.05435608e+00 1.44091589e+01 2.24581062e+02
1716.lowfreq: -8.1875 -7.1207 0.0011 0.0011 0.0015 9.8263 17.9174 27.2297 38.8198
frequency: 17.1928 27.1162 38.7395 46.4264 55.7948 59.5849 64.3090 83.4039 104.2253 118.6400 137.8657 164.7988 170.9481 209.3487 224.4569 241.3072 247.8355 265.3683 287.8827 290.5311 312.2739 340.3240 357.7888 375.2974 398.6520 402.6320 405.5436 435.5254 442.8062 465.4784 473.8482 503.8559 520.3152 546.7623 573.6897 581.3882 600.5788 615.7608 627.2331 661.8353 678.2826 692.4172 696.7388 703.9023 732.7027 751.0618 789.4941 805.3058 823.8819 837.7385 847.1103 857.6768 861.6768 880.4345 906.2112 917.9078 924.3418 937.3303 975.4012 982.7389 989.9024 997.5290 1007.3119 1020.2874 1025.5335 1030.5308 1035.2110 1037.2521 1050.9997 1071.3747 1078.5201 1082.7086 1087.5594 1102.3696 1117.7063 1121.5259 1124.7955 1139.0733 1156.0706 1169.3943 1175.5162 1187.8461 1190.4623 1208.0032 1212.2650 1233.2381 1260.1577 1272.9527 1286.2353 1291.1680 1310.9758 1327.0102 1332.0756 1337.1804 1351.6027 1369.8061 1373.4697 1375.4764 1381.6624 1386.7434 1411.2488 1431.2496 1449.2996 1453.8261 1455.8488 1458.8624 1464.7749 1466.5149 1473.3010 1474.8091 1475.8507 1492.6355 1538.8202 1549.4171 1556.9543 1591.0277 1605.9682 2353.6661 2932.2751 2941.1555 2964.3132 2968.9284 2971.8519 2977.9869 2998.1887 3038.5551 3047.5259 3048.2350 3064.1886 3088.2092 3092.6888 3106.5195 3119.8361 3122.9960 3131.7229 3148.6006 3161.1289 3166.7539 3174.0507 3208.1196 3230.4360
redmass: 5.4143 5.4487 4.1761 8.0241 4.0919 3.6444 4.7861 3.7850 1.1108 4.9352 4.6319 3.6238 3.8475 5.0600 5.2093 3.9838 2.1921 5.0509 5.2299 4.0935 4.3642 3.0604 3.2135 3.1440 4.9694 2.9463 4.2755 2.3853 3.8142 4.1624 2.7690 3.5717 3.1268 3.9918 4.4692 2.1926 7.1100 6.4225 4.5702 6.6941 6.7836 3.0113 1.5396 2.1714 2.1494 2.6620 2.9466 3.8090 3.8176 1.6932 1.4392 1.2623 2.5105 3.2752 2.4870 2.0168 1.5948 1.5702 2.8425 1.4411 4.5262 1.3527 2.4301 2.3755 2.5677 2.0602 3.4890 1.7834 2.1206 1.6457 1.7871 2.6414 1.8149 2.2755 1.5189 2.2210 2.0813 3.1254 2.4871 1.0977 1.6190 1.1964 1.0764 1.7418 1.4235 1.4240 1.7608 1.2690 1.2744 1.3265 1.3419 2.1988 1.3769 1.2536 1.2946 1.3253 1.3353 1.3727 8.4317 1.5811 1.2844 2.1980 1.0810 1.0804 1.1040 1.0850 1.0972 1.1032 2.5703 1.4031 2.5486 1.0651 4.3150 1.2264 5.5106 6.1478 6.0386 1.0904 1.0687 1.0663 1.0629 1.0656 1.0369 1.0660 1.0685 1.0994 1.0971 1.1006 1.0933 1.0978 1.0990 1.0960 1.0847 1.0969 1.0893 1.0940 1.0974 1.0910 1.0954 1.0954 1.1003
irintensity: 1.7269 0.8847 0.1781 0.1751 0.7914 0.2278 0.8463 0.8721 0.3516 2.8034 1.4790 0.6930 2.0442 1.2812 3.9532 1.4884 2.1183 1.9024 0.7584 6.0027 11.3900 1.5460 4.6143 10.4791 5.5851 0.6717 13.4469 33.7964 4.0003 2.7802 0.5800 7.8215 0.7158 26.0786 1.7275 11.0563 12.4887 0.1197 10.5045 11.7166 1.4968 29.7441 61.4332 33.4181 96.7801 45.1877 1.7191 19.0857 9.9305 5.0145 16.2926 0.5156 21.0409 11.5381 40.1323 18.6607 1.3249 0.2782 3.8915 0.1155 0.6503 0.1216 17.6084 46.1502 18.9714 18.6129 22.5037 23.5532 26.4866 12.4793 3.5889 36.9474 7.0119 13.7137 34.6837 6.5871 32.8095 14.7583 27.9683 1.5413 25.2019 4.3942 0.1238 115.9861 76.3030 16.4510 34.8595 9.0120 6.0559 12.6817 2.9809 5.9998 12.0982 3.0513 2.9000 13.5103 2.5840 6.7754 0.4098 45.3430 65.0636 10.7232 4.4420 8.1395 13.9652 3.3570 7.9463 3.8217 24.8617 11.2210 7.3402 18.4614 11.5374 34.8907 205.1138 1.4499 10.0185 2141.4333 30.2699 37.2499 21.2942 28.9271 69.5600 36.7946 81.4900 14.3624 16.7361 51.3841 19.0537 31.5760 24.5489 2.8166 0.4690 1.4789 19.3474 29.6508 17.6762 11.6065 11.0297 2.2543 2.7807
temp: 298.150 k
press: 1.00000 atm
elementType: 16 8 8 8 7 7 6 6 6 6 6 6 6 6 6 6 6 6 6 6 6 6 6 6 6 1 1 1 1 1 1 1 1 1 1 1 1 1 1 1 1 1 1 1 1 1 1 1 1
symmnumber: 1
zpe: 1045641.2 jmol-1
zpe.correction: 0.398264 hartree
zpe.thermalcorrener: 0.421864 hartree
zpe.thermalcorrenthalpy: 0.422808 hartree
zpe.thermalcorrgfe: 0.343590 hartree
zpe.sumelectzpe: -1469.739787 hartree
zpe.sumelectthermal: -1469.716186 hartree
zpe.sumelectthermalent: -1469.715242 hartree
zpe.sumelectthermalfe: -1469.794461 hartree
dipole: 3.1063 -4.6921 -0.6969
dipole: 5.6701
quadrupole: -155.7341 -142.8022 -151.1194
quadrupole: -9.6810 -0.7604 3.4112
quadrupole: -5.8488 7.0830 -1.2342 -9.6810 -0.7604 3.4112
hfenergy: -1470.1380503 hartree
pointgroup: C01 [X(C19H24N2O3S1)]
dipole: 1.9232827 0.3347927 1.0794979 debye
polarizability: 246.5786462|0.4484942|228.8260152|-3.0434008|-17.1705481|231.6354501 unknown
InChI: InChI=1S/C19H24N2O3S/c1-20(9-10-21-11-13-24-14-12-21)18(22)19(23,17-8-5-15-25-17)16-6-3-2-4-7-16/h2-8,15,23H,9-14H2,1H3
charge 0 multiplicity 1
49 atoms
S  -0.761956 -0.719257 -2.61094
O  3.111914 1.925366 -2.880379
O  0.929648 -0.97651 -0.30639
O  -1.241742 1.355966 1.545675
N  2.874914 0.748991 -0.224013
N  0.910301 0.714971 2.098733
C  3.272761 0.49796 1.20277
C  3.899302 0.269843 -1.211561
C  2.541404 2.1906 -0.482859
C  2.125582 -0.127469 2.043472
C  3.389816 0.499128 -2.645452
C  2.076605 2.380729 -1.936586
C  -0.349166 -0.506617 0.195188
C  -0.243906 0.597271 1.32171
C  -1.080707 -1.722524 0.839865
C  -1.154453 0.029942 -0.997779
C  0.916305 1.74697 3.158973
C  -0.469185 -2.99805 0.832807
C  -2.362666 -1.566148 1.423298
C  -2.209034 0.922453 -1.118954
C  -2.719314 1.049066 -2.465112
C  -1.132143 -4.107158 1.407637
C  -3.019309 -2.673975 2.000934
C  -2.065352 0.244069 -3.381898
C  -2.40738 -3.9500 1.995955
H  4.124524 -0.20795 1.219621
H  3.62446 1.442482 1.667315
H  4.861269 0.808989 -1.064704
H  4.068002 -0.809912 -1.043787
H  1.739589 2.497653 0.211115
H  3.437903 2.82298 -0.293223
H  1.868826 -1.118914 1.64554
H  2.494052 -0.250576 3.080818
H  4.161141 0.21931 -3.381042
H  2.471896 -0.100256 -2.82236
H  1.130337 1.829412 -2.116296
H  1.922937 3.449737 -2.154726
H  0.013625 2.365725 3.051468
H  0.90773 1.272351 4.158705
H  1.817532 2.38315 3.076372
H  0.510309 -3.104377 0.359216
H  -2.838331 -0.579884 1.43016
H  1.636648 -0.188284 -0.388116
H  -2.590036 1.476468 -0.261016
H  -3.541087 1.718238 -2.733905
H  -0.653974 -5.093577 1.390416
H  -4.009549 -2.541892 2.451785
H  -2.23479 0.144385 -4.452991
H  -2.920849 -4.810273 2.440637
