program: Gaussian 09
title: 000210595
version: EM64L-G09RevD.01
frameworkgroup: C1[X(C13H23NO2)]
method: RPBEPBE
basis: SDD
operation: Freq
keyword: #p
keyword: freq=noraman
keyword: PBEPBE/SDD
title: #p freq=noraman PBEPBE/SDD
converged: YES YES NO NO
title: Mulliken charges:
elementType: O O N C C C C C C C C C C C C C H H H H H H H H H H H H H H H H H H H H H H H
charge: -0.213511 -0.213928 -0.347331 0.367215 -0.459595 -0.540012 -0.547914 -0.411220 -0.756915 -0.375980 0.120038 0.120668 -0.377219 -0.353524 -0.357241 -0.695768 0.210760 0.198393 0.256368 0.248041 0.246429 0.261628 0.210479 0.210656 0.218494 0.225454 0.230385 0.193863 0.192536 0.191230 0.191558 0.350427 0.188763 0.188635 0.195550 0.195888 0.209905 0.210016 0.216775
chargesum: 0.00000
title: Mulliken charges with hydrogens summed into heavy atoms:
elementType: O O N C C C C C C C C C C C C C
charge: -0.213511 -0.213928 0.003096 0.367215 -0.050442 -0.035603 -0.039856 0.009915 -0.082581 0.010418 0.120038 0.120668 0.005570 0.023874 0.034198 -0.059072
polarizability: 1.89123124e+02 4.92772474e+00 1.50420462e+02 -1.52378191e+00 1.78516988e+00 1.15718672e+02
1716.lowfreq: -7.1446 -2.8318 -0.0003 0.0002 0.0005 9.4916 27.4511 39.8967 47.0174
frequency: 27.0209 39.8640 46.4190 75.2570 80.0541 96.7429 109.2727 126.6303 145.0242 148.1276 169.0099 177.8295 216.2809 233.7515 247.8099 307.4425 324.2530 339.2573 355.3035 398.0383 411.2749 447.5784 474.3107 515.0624 535.5062 558.7284 588.2232 625.2700 722.4206 730.7122 758.1218 793.3665 807.4699 820.5880 853.2796 888.5497 890.5433 899.3279 911.8763 920.9440 961.2430 976.2768 993.0194 1004.2162 1028.4584 1049.5195 1061.6171 1078.2850 1079.9560 1112.4885 1133.7860 1140.8585 1161.1342 1190.2979 1213.6384 1230.1476 1243.2232 1256.5199 1265.1014 1276.2900 1281.5866 1284.7991 1291.1172 1298.6945 1313.8287 1318.0876 1322.9501 1330.3539 1348.1301 1355.5523 1359.8922 1370.7068 1390.9276 1397.0458 1432.8814 1441.6876 1456.6124 1461.7525 1463.4587 1468.9727 1476.1927 1478.1683 1479.3811 1483.4344 1487.0070 1488.9926 1636.5271 1640.0901 2944.6813 2951.2557 2951.9339 2958.5971 2967.9756 2971.5635 2972.5578 2973.4444 2975.3200 2981.6212 2985.5449 2993.8377 2998.5560 3014.1146 3031.7862 3044.9701 3067.8161 3068.9480 3071.8572 3071.9403 3078.4338 3083.5351 3483.4129
redmass: 4.2874 4.3603 1.6793 3.2414 3.2863 1.6993 3.9800 3.0644 3.5634 1.9075 2.8361 4.8861 1.8581 1.1151 1.3945 2.3833 2.3822 4.6576 3.3589 3.7329 2.4937 4.1746 3.1076 4.5480 2.6061 4.1360 3.3323 4.0710 1.0624 1.0926 1.1660 1.9386 1.6722 1.2742 4.6013 1.9163 1.7953 1.5990 1.9546 2.2141 1.9866 1.8684 1.3447 3.3358 2.9353 2.4457 1.6043 2.3294 2.2784 2.0808 1.8251 1.6118 1.8491 1.6764 1.4164 1.4401 1.6664 2.3942 1.4148 1.3360 1.5531 1.1270 1.2727 1.1366 2.1617 1.4890 1.9633 1.5978 1.4791 1.6697 1.5400 1.8440 1.2175 1.1987 1.0828 1.0797 1.0792 1.0716 1.0704 1.0774 1.0757 1.0425 1.0589 1.0781 1.0649 1.0892 10.0325 5.7073 1.0596 1.0589 1.0588 1.0590 1.0591 1.0619 1.0367 1.0638 1.0633 1.0403 1.0964 1.0971 1.1009 1.1033 1.1044 1.1044 1.0942 1.1007 1.0991 1.0991 1.0934 1.0977 1.0760
irintensity: 0.7104 0.5596 0.0097 0.6723 0.1893 0.0479 2.9285 2.1517 3.3836 0.0783 0.7427 0.2434 0.2306 0.0016 0.1512 0.5626 1.6839 15.5296 1.5253 4.8420 3.5053 8.8795 2.1197 3.6393 3.5398 15.2275 5.9355 0.8200 13.4973 0.0547 3.1689 42.2748 63.7976 4.3276 5.8035 3.2580 1.3240 1.0848 5.7022 3.5982 1.8938 0.9048 0.8463 1.3036 5.0415 0.6901 3.1298 1.1223 0.7418 16.9367 11.8418 20.3453 9.5355 2.6408 13.3562 1.0897 2.3670 139.1462 3.2552 13.2900 84.3927 26.0142 6.7616 3.3039 56.0474 19.9430 58.0121 9.8887 1.5528 0.1411 3.2259 10.2644 11.2281 22.4262 4.2656 4.3055 2.3953 0.0532 0.1523 0.7776 2.2724 12.3074 4.5433 1.0829 5.0368 32.1027 177.5582 435.5104 16.9755 2.1091 0.7107 23.6358 56.8370 45.7419 34.6843 65.0153 26.9796 8.9402 0.7595 8.0435 4.9994 1.0857 10.7383 149.0198 5.7160 94.2836 52.9778 42.1675 1.9863 33.2346 36.8202
temp: 298.150 k
press: 1.00000 atm
elementType: 8 8 7 6 6 6 6 6 6 6 6 6 6 6 6 6 1 1 1 1 1 1 1 1 1 1 1 1 1 1 1 1 1 1 1 1 1 1 1
symmnumber: 1
zpe: 894060.0 jmol-1
zpe.correction: 0.340529 hartree
zpe.thermalcorrener: 0.358805 hartree
zpe.thermalcorrenthalpy: 0.359749 hartree
zpe.thermalcorrgfe: 0.292872 hartree
zpe.sumelectzpe: -713.140395 hartree
zpe.sumelectthermal: -713.122120 hartree
zpe.sumelectthermalent: -713.121176 hartree
zpe.sumelectthermalfe: -713.188053 hartree
dipole: 4.1291 -1.1030 -0.1426
dipole: 4.2763
quadrupole: -122.3734 -113.9380 -96.6923
quadrupole: -0.7904 0.0803 -0.7089
quadrupole: -11.3722 -2.9368 14.3089 -0.7904 0.0803 -0.7089
hfenergy: -713.4809248 hartree
pointgroup: C01 [X(C13H23N1O2)]
dipole: -1.6245368 -0.4319623 0.0696544 debye
polarizability: 189.1036877|-4.9861291|150.3608572|-1.7447357|-2.318537|115.7977129 unknown
InChI: InChI=1S/C13H23NO2/c1-3-4-5-6-7-8-13(2)9-11(15)14-12(16)10-13/h14H,3-10H2,1-2H3
charge 0 multiplicity 1
39 atoms
O  4.908764 -1.745498 0.212316
O  3.551452 2.679661 0.075407
N  4.161392 0.447293 0.172111
C  1.446766 -0.399069 -0.208914
C  0.027576 -0.861623 0.242955
C  2.48526 -1.370814 0.424284
C  1.743837 1.030506 0.32827
C  -1.168379 -0.017092 -0.251994
C  1.571494 -0.43287 -1.75538
C  -2.520538 -0.571565 0.25353
C  3.937092 -0.945573 0.254242
C  3.192907 1.476415 0.174633
C  -3.737098 0.25309 -0.223398
C  -5.087168 -0.305422 0.28026
C  -6.306162 0.518609 -0.193648
C  -7.650115 -0.048395 0.312693
H  -0.115744 -1.909909 -0.093799
H  0.004703 -0.886777 1.353881
H  2.393541 -2.387414 0.003814
H  2.295607 -1.459881 1.514677
H  1.498687 1.081064 1.410192
H  1.124491 1.793927 -0.171391
H  -1.062306 1.032577 0.08924
H  -1.184606 0.010011 -1.359574
H  1.319013 -1.437333 -2.142602
H  0.889342 0.295348 -2.227909
H  2.596693 -0.191597 -2.091308
H  -2.635351 -1.622436 -0.085837
H  -2.512382 -0.603371 1.363351
H  -3.7460 0.286391 -1.333053
H  -3.625066 1.303597 0.117838
H  5.140617 0.745838 0.077599
H  -5.079508 -0.340362 1.389942
H  -5.201693 -1.355415 -0.062139
H  -6.312811 0.554036 -1.30231
H  -6.192606 1.567196 0.149742
H  -7.802909 -1.08445 -0.044502
H  -7.680716 -0.068023 1.418541
H  -8.504674 0.558927 -0.038059
