program: Gaussian 09
title: 000210594
version: EM64L-G09RevD.01
frameworkgroup: C1[X(C17H22ClN3)]
method: RPBEPBE
basis: SDD
operation: Freq
keyword: #p
keyword: freq=noraman
keyword: PBEPBE/SDD
title: #p freq=noraman PBEPBE/SDD
converged: YES YES NO NO
title: Mulliken charges:
elementType: Cl N N N C C C C C C C C C C C C C C C C C H H H H H H H H H H H H H H H H H H H H H H
charge: -0.059266 -0.113087 -0.383708 -0.047200 -0.421850 -0.307897 -0.309218 -0.191087 -0.488566 0.367891 -0.678643 -0.679269 -0.182251 0.278575 -0.027857 -0.320284 -0.337324 -0.292379 -0.386863 -0.271519 -0.091072 0.197437 0.210654 0.204751 0.182763 0.217679 0.182833 0.246864 0.226953 0.230385 0.207288 0.229349 0.210540 0.207927 0.227177 0.209355 0.256941 0.295476 0.224164 0.198624 0.286837 0.233673 0.255205
chargesum: 0.00000
title: Mulliken charges with hydrogens summed into heavy atoms:
elementType: Cl N N N C C C C C C C C C C C C C C C C C
charge: -0.059266 -0.113087 -0.088232 -0.047200 -0.013758 0.079616 0.091294 0.055777 -0.031227 0.367891 -0.031466 -0.034811 0.074691 0.278575 -0.027857 -0.096120 -0.138701 -0.005541 -0.153190 -0.016314 -0.091072
polarizability: 3.36568316e+02 -2.19205444e+01 2.14541232e+02 -2.32605910e+01 -2.30900055e+01 1.48309376e+02
1716.lowfreq: -9.1798 0.0005 0.0006 0.0008 2.0611 4.1052 14.3496 16.0942 20.2063
frequency: 13.5117 15.8011 20.0500 47.5982 52.3212 67.1242 81.1958 100.2446 119.7217 129.3594 155.0068 187.2958 190.9292 216.5495 222.2299 242.2547 253.7317 273.7144 284.4077 296.7236 331.5446 350.1136 394.4031 409.2494 431.1842 440.8238 452.8077 467.4049 501.5434 503.1442 514.9270 562.4095 573.2356 616.9838 630.8611 641.3922 718.0586 733.4846 759.1847 786.1650 798.3079 802.5971 808.0993 820.6147 826.4840 859.1828 897.7548 900.3771 933.4178 948.9388 950.4434 970.6518 982.6287 989.7235 995.0692 1051.7488 1062.1956 1070.3830 1074.4426 1086.0141 1096.5963 1100.3103 1123.6126 1135.9921 1161.2871 1169.2161 1198.6816 1207.0520 1214.9117 1241.9680 1250.6569 1274.7898 1281.6493 1286.0614 1294.5320 1313.8734 1331.3362 1341.5668 1356.6505 1363.2081 1367.9443 1375.8116 1387.6764 1388.9407 1391.5895 1414.8884 1439.9209 1455.6970 1464.5159 1469.0720 1469.4098 1473.8621 1474.9598 1478.3738 1486.6408 1492.4763 1531.6990 1559.1044 1582.9162 1609.7990 1679.3146 2845.8684 2847.0629 2861.6319 2983.9596 2984.8871 2994.2006 3008.5029 3026.0434 3041.4182 3051.7321 3075.1723 3077.6987 3085.7952 3091.9182 3092.3811 3097.6849 3118.3578 3119.9116 3171.7954 3173.8870 3183.6954 3574.4071
redmass: 3.7870 5.9984 4.9164 3.2169 3.4236 5.5523 1.8791 1.9159 4.7435 2.8963 5.8101 1.7390 2.1653 1.8181 2.2130 4.5867 4.1498 4.6864 2.2098 2.0446 2.0314 4.8033 2.8684 2.5201 3.3445 2.0149 2.6760 3.1039 3.9669 3.0041 3.1316 4.5618 5.2553 6.0081 4.9754 3.3825 3.9638 2.6251 1.8398 1.5429 1.1474 1.2653 2.2051 1.5574 5.5080 5.9989 1.4955 1.9551 1.3493 1.4895 1.8682 1.9868 1.4566 1.6396 3.4899 2.9470 1.8820 2.5598 1.9004 2.1792 2.6862 2.0405 2.5070 2.5310 1.7203 1.5712 2.1177 1.9673 1.4919 1.4111 1.2695 1.1320 1.2879 1.2099 1.2591 2.4006 1.8847 1.4748 1.5595 1.3286 1.9399 1.4236 1.2323 1.2353 3.9999 2.8856 2.4680 1.0811 1.0541 1.4878 1.1661 1.0726 1.2807 1.0611 1.0602 1.0720 4.5844 3.7781 6.5016 6.6744 6.5031 1.0723 1.0715 1.0704 1.0360 1.0357 1.0606 1.0852 1.0877 1.0874 1.1013 1.0982 1.0976 1.0938 1.1003 1.1003 1.0886 1.0898 1.0884 1.0930 1.0951 1.0932 1.0762
irintensity: 0.3806 0.2489 1.3840 0.2060 0.0361 0.1097 0.7408 0.6068 0.2942 0.5857 0.4933 1.5494 1.6783 0.6067 0.2497 0.3573 1.5281 2.1736 0.8405 0.8195 2.7778 7.9424 0.7060 13.5895 0.5047 44.2408 40.3668 23.1142 2.4612 9.4361 14.3138 5.8511 5.6625 0.8136 14.0627 9.5572 5.4037 12.0861 17.6595 8.2044 4.2714 4.1416 43.0012 30.4304 32.3548 63.5976 25.0313 5.9269 0.2190 2.3112 6.0261 19.7109 22.9038 40.3095 15.8257 24.5012 14.3100 9.7920 19.6644 3.1320 2.3121 14.4862 50.5999 24.6221 17.2833 3.0072 35.2019 12.3569 20.0601 3.5069 3.4807 9.4371 4.1905 22.3649 7.3658 2.4779 87.5016 14.0937 64.2988 10.8143 1.4703 3.1967 20.1970 25.1430 76.4416 17.2667 48.9089 2.5532 5.3046 20.1042 7.1237 13.0151 22.5334 7.2299 8.9902 13.1067 76.0746 167.3180 379.2731 74.9222 0.8025 30.5817 40.8751 216.5035 30.4635 33.0178 36.2965 18.5852 11.7206 11.8215 12.3927 42.9716 83.4613 4.5184 32.1001 45.9401 27.0752 27.1789 15.6718 27.4703 4.5587 0.8211 23.4391
temp: 298.150 k
press: 1.00000 atm
elementType: 17 7 7 7 6 6 6 6 6 6 6 6 6 6 6 6 6 6 6 6 6 1 1 1 1 1 1 1 1 1 1 1 1 1 1 1 1 1 1 1 1 1 1
symmnumber: 1
zpe: 932275.8 jmol-1
zpe.correction: 0.355085 hartree
zpe.thermalcorrener: 0.376797 hartree
zpe.thermalcorrenthalpy: 0.377741 hartree
zpe.thermalcorrgfe: 0.300537 hartree
zpe.sumelectzpe: -1283.727623 hartree
zpe.sumelectthermal: -1283.705911 hartree
zpe.sumelectthermalent: -1283.704967 hartree
zpe.sumelectthermalfe: -1283.782171 hartree
dipole: -6.2429 -1.3845 1.7507
dipole: 6.6299
quadrupole: -155.2157 -131.5972 -133.1401
quadrupole: -6.0184 9.1728 -1.6827
quadrupole: -15.2314 8.3871 6.8443 -6.0184 9.1728 -1.6827
hfenergy: -1284.0827082 hartree
pointgroup: C01 [X(C17H22Cl1N3)]
dipole: 2.4892263 0.168199 0.7611366 debye
polarizability: 333.5952204|-35.0477103|199.0097819|13.7705746|37.8006584|166.8139211 unknown
InChI: InChI=1S/C17H22ClN3/c1-3-21(4-2)12-6-5-10-19-16-9-11-20-17-13-14(18)7-8-15(16)17/h5-9,11,13,19H,3-4,10,12H2,1-2H3
charge 0 multiplicity 1
43 atoms
Cl -6.854537 2.165607 0.263131
N  5.419982 0.329939 -0.220508
N  -0.451193 -0.380473 1.12576
N  -3.610559 -1.439526 -1.583042
C  4.030327 0.828163 -0.403575
C  6.432109 1.257408 -0.795908
C  5.576793 -1.071538 -0.700555
C  3.05483 0.156599 0.540133
C  0.88241 -1.010943 1.15318
C  -1.464878 -0.718919 0.242974
C  6.642051 2.529176 0.048342
C  6.780807 -1.796441 -0.069892
C  1.862738 -0.382245 0.176303
C  -2.739766 -0.012708 0.284117
C  -3.766576 -0.413115 -0.657162
C  -1.330532 -1.75423 -0.711197
C  -3.029051 1.044424 1.203332
C  -5.027503 0.268484 -0.651852
C  -2.415802 -2.068014 -1.573387
C  -4.263906 1.701315 1.199596
C  -5.249324 1.296526 0.256705
H  3.67276 0.719662 -1.459573
H  4.035672 1.913196 -0.181456
H  7.391876 0.713281 -0.846163
H  6.172854 1.539784 -1.848942
H  4.654408 -1.615785 -0.425521
H  5.650338 -1.113122 -1.818048
H  3.374559 0.131465 1.593456
H  0.754929 -2.09015 0.945358
H  1.281169 -0.934134 2.181363
H  5.733417 3.156641 0.097081
H  6.924705 2.256439 1.07994
H  7.447283 3.149452 -0.387465
H  7.743803 -1.329488 -0.344648
H  6.696815 -1.782217 1.030733
H  6.814296 -2.848482 -0.409403
H  1.552147 -0.36396 -0.878981
H  -0.549261 0.480696 1.661585
H  -0.400387 -2.318127 -0.815343
H  -2.292612 1.362733 1.950857
H  -5.781891 -0.052697 -1.374093
H  -2.296026 -2.875639 -2.306436
H  -4.477276 2.507257 1.906901
