program: Gaussian 09
title: 000210588
version: EM64L-G09RevD.01
frameworkgroup: C1[X(C13H20N2O4)]
method: RPBEPBE
basis: SDD
operation: Freq
keyword: #p
keyword: freq=noraman
keyword: PBEPBE/SDD
title: #p freq=noraman PBEPBE/SDD
converged: NO YES NO NO
title: Mulliken charges:
elementType: O O O O N N C C C C C C C C C C C C C H H H H H H H H H H H H H H H H H H H H
charge: -0.453521 -0.235739 -0.233426 -0.207703 -0.247107 -0.380998 -0.001169 -0.480606 -0.480111 -0.411899 -0.410981 -0.092068 -0.324414 0.224498 0.209784 -0.392933 0.131363 -0.357430 -0.687759 0.259274 0.220014 0.253013 0.247789 0.219893 0.226429 0.196885 0.197071 0.226049 0.224960 0.290019 0.239239 0.241112 0.347573 0.364880 0.213931 0.212053 0.215468 0.215103 0.221463
chargesum: 0.00000
title: Mulliken charges with hydrogens summed into heavy atoms:
elementType: O O O O N N C C C C C C C C C C C C C
charge: -0.105948 -0.235739 -0.233426 -0.207703 -0.247107 -0.016117 0.258105 -0.007579 -0.012429 0.011415 0.012139 0.132892 -0.034395 0.224498 0.209784 0.087418 0.131363 0.068555 -0.035725
polarizability: 1.94698805e+02 7.43405848e-01 1.54428091e+02 -8.75846254e+00 -1.13041026e+01 1.34400862e+02
1716.lowfreq: -10.8747 -0.0005 -0.0002 0.0008 3.1613 13.3577 22.5674 28.3335 38.2181
frequency: 20.8968 27.3358 37.7707 58.9313 72.7347 87.4875 137.7769 153.6886 155.9523 168.4266 211.9670 214.3272 233.2249 258.2543 271.6528 284.4822 360.7404 369.9181 375.7978 383.5714 398.3114 408.9603 451.6184 462.7046 479.6686 490.1652 505.9759 593.4764 623.1973 657.6153 668.4745 708.9216 732.7583 741.3396 774.7954 779.1027 787.4605 793.9612 824.5413 849.7176 876.2375 911.5592 927.2455 928.2767 939.9081 969.9615 998.4827 1032.0543 1045.5137 1062.0121 1076.1913 1081.5321 1085.2738 1092.6551 1108.7647 1121.8764 1155.8040 1188.6744 1198.0137 1205.4478 1212.1952 1241.6065 1254.3634 1271.9990 1276.5493 1298.3363 1306.3355 1308.2206 1318.6119 1320.9435 1334.8578 1337.0875 1351.3952 1351.6475 1352.8145 1356.6293 1368.7554 1373.0403 1390.9503 1393.0703 1449.9179 1454.0808 1461.3223 1471.7994 1478.3585 1482.3297 1484.9974 1492.2505 1582.8036 1648.1401 1651.9699 2969.4388 2977.9764 2980.4960 2985.3370 3001.4789 3006.1399 3006.3567 3016.8240 3017.4883 3032.4637 3051.1491 3051.2410 3057.5302 3065.2339 3070.8209 3074.9642 3079.5858 3080.9024 3515.4273 3536.0887
redmass: 4.4160 5.1454 5.3433 4.5681 3.2698 1.9755 4.8866 7.0480 5.9865 4.8768 2.2734 2.5545 1.4251 3.0817 2.7889 3.1706 3.0896 9.6289 2.1278 1.2144 2.8849 8.3237 3.0518 3.5053 5.7293 4.1590 5.8675 8.6918 4.0257 3.2752 3.0063 5.0761 3.6468 1.2233 1.7349 1.4663 3.1211 3.2501 2.4525 1.8259 2.0277 2.3019 2.1013 2.9145 1.4086 2.1475 2.6361 3.1975 2.3044 2.4220 2.3581 1.2253 1.8147 2.8706 1.7911 1.8732 1.7509 1.5830 1.7612 1.5841 2.0207 1.3645 1.4090 1.4112 1.3598 1.4545 1.2658 1.4286 2.3049 1.5849 1.3759 1.7956 1.4800 1.3685 2.8341 1.5386 1.2701 1.5115 1.7242 1.2533 1.0872 1.0888 1.0892 1.0661 1.0415 1.0803 1.0730 1.0840 10.0721 5.6233 10.2578 1.0589 1.0360 1.0634 1.0631 1.0613 1.0631 1.0661 1.0998 1.0757 1.0868 1.0981 1.0916 1.0949 1.1016 1.1019 1.0989 1.0995 1.1036 1.0767 1.0660
irintensity: 1.2585 0.9035 0.4103 0.9222 0.5617 0.1089 4.3716 5.4205 1.7219 0.1564 8.9208 5.9076 2.0499 2.0568 8.7993 0.9448 12.8126 18.5874 9.7279 77.5128 24.7344 4.5506 5.5212 5.8737 19.3264 9.4835 27.0373 0.5586 13.9518 2.2250 13.1590 0.4805 1.5613 8.3792 73.6032 5.9021 19.8227 28.0111 3.1131 4.9996 3.2020 22.3598 6.7615 21.5856 15.4946 10.7871 13.6200 11.3568 3.6891 29.3834 23.6501 0.8069 1.1203 6.7240 30.4351 3.0931 7.0044 38.6795 36.2964 0.6907 73.4664 44.0978 20.1384 20.7527 10.8011 43.4464 22.3121 3.1540 199.6543 0.6334 3.5230 133.8008 16.9355 8.0465 181.9036 14.9118 6.1707 18.0562 41.8720 3.8706 9.6705 25.2936 12.6166 2.4993 14.8864 7.5030 14.4970 10.7348 328.0323 452.2967 100.7434 30.8215 30.6670 9.1122 51.9680 34.0462 16.3399 20.3110 9.9456 8.6473 13.5132 41.3567 32.6273 34.1192 5.2562 11.5088 27.9509 36.0512 48.2820 66.7618 3.9164
temp: 298.150 k
press: 1.00000 atm
elementType: 8 8 8 8 7 7 6 6 6 6 6 6 6 6 6 6 6 6 6 1 1 1 1 1 1 1 1 1 1 1 1 1 1 1 1 1 1 1 1
symmnumber: 1
zpe: 851008.5 jmol-1
zpe.correction: 0.324132 hartree
zpe.thermalcorrener: 0.342902 hartree
zpe.thermalcorrenthalpy: 0.343846 hartree
zpe.thermalcorrgfe: 0.275702 hartree
zpe.sumelectzpe: -916.362263 hartree
zpe.sumelectthermal: -916.343493 hartree
zpe.sumelectthermalent: -916.342549 hartree
zpe.sumelectthermalfe: -916.410693 hartree
dipole: 0.6412 -0.4467 1.2342
dipole: 1.4608
quadrupole: -127.3621 -120.3296 -115.7040
quadrupole: 13.1009 -2.2580 7.0380
quadrupole: -6.2302 0.8023 5.4279 13.1009 -2.2580 7.0380
hfenergy: -916.6863953 hartree
pointgroup: C01 [X(C13H20N2O4)]
dipole: 0.258451 0.2653345 -0.4394142 debye
polarizability: 193.9915977|-0.1765389|157.4558028|11.4163759|-7.0115433|132.0803573 unknown
InChI: InChI=1S/C13H20N2O4/c1-2-3-10-11(17)14-13(19)15(12(10)18)8-4-6-9(16)7-5-8/h8-10,14,16H,2-7H2,1H3
charge 0 multiplicity 1
39 atoms
O  -3.849293 -2.089121 0.519021
O  -0.120371 -1.330122 1.353737
O  0.073521 2.78452 -0.89335
O  3.923392 1.328677 1.224335
N  -0.066745 0.703883 0.204562
N  1.965993 1.988515 0.178035
C  -1.520507 0.590705 -0.192427
C  -2.444193 0.589768 1.053039
C  -1.73622 -0.617959 -1.140339
C  -3.924707 0.407811 0.63697
C  -3.232741 -0.7655 -1.508443
C  -4.116165 -0.851181 -0.241894
C  2.029722 -0.224133 1.289746
C  0.537542 -0.324687 0.963912
C  0.618124 1.875303 -0.21594
C  2.795599 -1.448721 0.675249
C  2.730215 1.074924 0.919454
C  2.768222 -1.505771 -0.868074
C  3.536136 -2.733993 -1.401885
H  -1.721982 1.513649 -0.765368
H  -2.321389 1.544779 1.597369
H  -2.149069 -0.216485 1.746159
H  -1.379956 -1.546896 -0.661061
H  -1.134229 -0.473259 -2.056947
H  -4.555116 0.322525 1.540724
H  -4.275415 1.294497 0.070931
H  -3.563624 0.099049 -2.118852
H  -3.377334 -1.676033 -2.117759
H  -5.177246 -0.953388 -0.527426
H  2.115104 -0.329391 2.389003
H  2.338201 -2.363421 1.094511
H  3.84047 -1.392888 1.032114
H  -2.908478 -2.082975 0.83505
H  2.42456 2.859772 -0.109888
H  3.215345 -0.582699 -1.288585
H  1.718957 -1.547292 -1.224239
H  4.596062 -2.70595 -1.08719
H  3.09494 -3.673612 -1.020046
H  3.512074 -2.773105 -2.505808
