program: Gaussian 09
title: 000210586
version: EM64L-G09RevD.01
frameworkgroup: C1[X(C13H22NO4PS)]
method: RPBEPBE
basis: SDD
operation: Freq
keyword: #p
keyword: freq=noraman
keyword: PBEPBE/SDD
title: #p freq=noraman PBEPBE/SDD
converged: YES YES NO NO
title: Mulliken charges:
elementType: S P O O O O N C C C C C C C C C C C C C H H H H H H H H H H H H H H H H H H H H H H
charge: -0.219841 0.868869 -0.503272 -0.468393 -0.460518 -0.289997 -0.215209 -0.352731 0.407124 -0.359238 0.162720 -0.498290 0.447100 -0.437084 -0.783686 -0.683842 -0.239499 -0.215779 -0.641014 -0.652579 0.211104 0.258408 0.253766 0.193804 0.258276 0.280395 0.243586 0.244476 0.243549 0.223752 0.224231 0.202979 0.225491 0.238096 0.228245 0.228815 0.215942 0.237383 0.242223 0.210509 0.237373 0.232754
chargesum: 0.00000
title: Mulliken charges with hydrogens summed into heavy atoms:
elementType: S P O O O O N C C C C C C C C C C C C C
charge: -0.219841 0.868869 -0.503272 -0.468393 -0.460518 -0.289997 -0.215209 0.116780 0.407124 0.088332 0.162720 -0.240014 0.447100 -0.156689 -0.052075 -0.032880 0.224089 0.241281 0.054535 0.028057
polarizability: 2.68352846e+02 -7.26587128e+00 2.15370168e+02 -2.45724024e-01 3.22444905e+00 1.56864107e+02
1716.lowfreq: -15.4856 -3.7819 -0.0030 -0.0029 -0.0025 6.0650 12.7031 22.5469 23.5779
frequency: -12.4628 21.5356 23.1931 29.0766 40.7248 41.1669 56.1865 63.1646 81.6052 95.8661 112.9878 135.7412 155.4408 162.0410 188.7498 195.4144 205.1535 220.0417 224.2393 225.0635 239.8192 256.6393 264.7887 278.4587 306.5951 350.1051 372.7138 380.8860 393.6249 406.7826 437.1096 460.0254 512.9254 522.1872 553.5843 561.1530 610.7899 644.3192 681.6932 692.6752 707.0947 712.0345 745.2247 776.5770 796.0876 809.1528 811.2970 843.3807 856.2991 870.8991 879.0993 893.5914 956.1336 971.9466 1004.3248 1019.0873 1032.3076 1046.7222 1052.4854 1095.1990 1105.6446 1110.9937 1119.2003 1133.7355 1141.1369 1156.0896 1163.6273 1203.3813 1228.7780 1255.4664 1265.9622 1269.5287 1297.8121 1312.0911 1352.6957 1354.6905 1355.5502 1379.9610 1393.1359 1394.5864 1395.2338 1406.1470 1429.0147 1451.9006 1457.8557 1463.5926 1465.2710 1469.1774 1476.1743 1477.2454 1479.4260 1481.9477 1483.5542 1486.4461 1488.1944 1554.4401 1577.1812 1642.2018 2976.6684 2985.0133 2989.6087 2990.4333 2990.8392 2997.2654 3007.7630 3029.4974 3047.5148 3057.2014 3064.4525 3073.3351 3082.1863 3082.2798 3087.1251 3093.8210 3096.2299 3108.3706 3112.0669 3112.4113 3198.4762 3201.7562
redmass: 3.9434 3.9984 3.8978 3.1844 3.0905 2.2391 3.4651 4.9700 4.8008 1.7365 4.8632 3.5044 4.9115 3.9495 2.7206 4.5217 3.5720 1.3029 1.8421 1.1891 1.4092 2.3713 2.6291 3.1948 4.4857 3.6037 5.0688 2.5970 5.7182 4.2339 5.7157 7.0512 5.7539 5.6027 3.9826 6.4239 4.6848 3.8666 6.2590 5.9768 7.8353 4.2899 1.1332 4.1821 1.1291 1.3719 1.1022 1.6418 1.4164 4.6938 3.9440 1.8205 2.4350 3.4377 2.4842 2.5304 1.6279 1.5637 2.8519 2.2254 2.2239 2.2375 2.7663 1.4302 1.5395 2.4302 3.1331 2.7913 1.4868 1.1423 1.3088 1.1173 1.2707 1.3118 1.5377 1.2623 1.3197 2.0110 1.2188 1.2328 1.2421 1.2493 2.4036 1.1027 1.0398 1.0469 1.0701 1.0582 1.0475 1.0572 1.0536 1.1059 1.1148 1.0760 1.1429 8.2487 6.5910 7.6572 1.0362 1.0391 1.0546 1.0632 1.0364 1.0383 1.0617 1.0595 1.0966 1.1078 1.0969 1.1003 1.0994 1.1031 1.0976 1.0981 1.1052 1.0980 1.1038 1.1023 1.0931 1.0925
irintensity: 2.5501 0.5945 1.6739 0.7995 0.8896 1.0786 1.0730 0.2725 1.7965 0.3232 1.9420 3.1144 0.6251 1.0723 5.5812 6.2656 6.0393 0.4308 2.9486 0.1248 0.0681 13.4067 0.1813 0.8744 3.6683 8.5080 4.3118 12.5094 1.7006 12.7707 12.0670 10.7683 5.7945 6.5811 3.6966 57.7084 1.4714 7.4129 66.9989 178.5418 100.6983 51.9093 9.1948 43.4103 5.8562 11.7508 5.3592 46.5704 3.4399 254.1372 142.7988 11.7059 24.2217 149.7145 163.8286 82.7083 22.0722 8.6155 0.5192 8.7154 9.9245 25.1701 133.9256 4.6326 8.0369 33.8430 35.7868 13.7559 55.0912 0.2513 0.9710 0.1828 0.8351 9.1574 66.0398 11.9476 6.0634 73.0438 8.7497 23.4320 29.4116 13.7038 11.5000 54.9378 12.6254 11.8851 4.8378 7.5738 5.5103 6.5345 11.5027 8.1822 32.0108 12.3392 16.9057 12.4729 249.7294 523.1738 42.0533 22.5360 21.5155 20.4526 12.9124 25.4694 30.9064 39.0119 0.8625 12.4467 12.0488 31.8096 36.1563 4.8130 36.5708 24.9776 26.1833 13.4876 22.4702 34.3432 0.5748 1.5298
temp: 298.150 k
press: 1.00000 atm
elementType: 16 15 8 8 8 8 7 6 6 6 6 6 6 6 6 6 6 6 6 6 1 1 1 1 1 1 1 1 1 1 1 1 1 1 1 1 1 1 1 1 1 1
symmnumber: 1
zpe: 886113.4 jmol-1
zpe.correction: 0.337503 hartree
zpe.thermalcorrener: 0.361165 hartree
zpe.thermalcorrenthalpy: 0.362109 hartree
zpe.thermalcorrgfe: 0.281385 hartree
zpe.sumelectzpe: -1601.956447 hartree
zpe.sumelectthermal: -1601.932785 hartree
zpe.sumelectthermalent: -1601.931841 hartree
zpe.sumelectthermalfe: -1602.012565 hartree
dipole: 0.0279 -4.0661 -0.0010
dipole: 4.0662
quadrupole: -111.0184 -123.4190 -143.8944
quadrupole: 13.9613 0.4386 -1.4393
quadrupole: 15.0922 2.6916 -17.7838 13.9613 0.4386 -1.4393
hfenergy: -1602.2939503 hartree
pointgroup: C01 [X(C13H22N1O4P1S1)]
dipole: -0.0869163 -1.595907 -0.0693385 debye
polarizability: 267.1298148|-10.708601|216.1201458|3.4392107|5.2993332|157.3371602 unknown
InChI: InChI=1S/C13H22NO4PS/c1-5-8-14-11(4)9-12(10-13(14)15)18-19(20,16-6-2)17-7-3/h9-10H,5-8H2,1-4H3
charge 0 multiplicity 1
42 atoms
S  2.517316 0.30346 2.263833
P  2.693241 -0.098419 0.250058
O  1.40056 -0.984869 -0.532913
O  2.882488 1.212395 -0.838156
O  3.990837 -1.10845 -0.249749
O  -2.287788 2.21187 -0.403665
N  -2.700352 -0.106966 -0.542665
C  -4.148337 0.233883 -0.529608
C  -2.247985 -1.42264 -0.586025
C  -4.707259 0.384802 0.904546
C  -1.801898 1.035012 -0.458727
C  -0.882015 -1.689258 -0.559669
C  0.041254 -0.600689 -0.498933
C  -0.389369 0.716187 -0.458404
C  -3.255048 -2.549609 -0.673631
C  -6.204341 0.758073 0.886623
C  3.597404 2.455783 -0.391524
C  4.231102 -2.385458 0.49407
C  2.588643 3.576836 -0.14729
C  5.592979 -2.893417 0.032306
H  -4.70959 -0.532829 -1.089755
H  -4.248975 1.200986 -1.051657
H  -4.127979 1.171273 1.42079
H  -4.558023 -0.556555 1.46954
H  -0.513648 -2.715205 -0.587694
H  0.301827 1.560466 -0.442635
H  -3.79363 -2.541453 -1.640134
H  -2.734096 -3.516083 -0.588788
H  -4.010749 -2.495535 0.13017
H  -6.366699 1.716187 0.359252
H  -6.594821 0.870437 1.913698
H  -6.810544 -0.016239 0.378457
H  4.1927 2.240421 0.515896
H  4.276225 2.678323 -1.231272
H  4.209979 -2.177284 1.581423
H  3.418278 -3.090018 0.238462
H  3.126814 4.521952 0.055785
H  1.950792 3.729398 -1.034791
H  1.946778 3.352095 0.721555
H  5.820758 -3.853278 0.53177
H  5.598786 -3.056599 -1.058454
H  6.386383 -2.169686 0.283703
