program: Gaussian 09
title: 000215896
version: EM64L-G09RevD.01
frameworkgroup: C1[X(C13H11ClN4O2)]
method: RPBEPBE
basis: SDD
operation: Freq
keyword: #p
keyword: freq=noraman
keyword: PBEPBE/SDD
title: #p freq=noraman PBEPBE/SDD
converged: NO YES NO NO
title: Mulliken charges:
elementType: Cl O O N N N N C C C C C C C C C C C C C H H H H H H H H H H H
charge: -0.036610 -0.255950 -0.267097 -0.289610 -0.151087 -0.223683 -0.085625 0.101596 0.089321 0.177981 0.217525 0.446487 -0.216495 -0.610559 -0.599993 -0.338656 -0.338779 -0.181918 -0.181965 -0.113044 0.277382 0.271592 0.247721 0.247709 0.268720 0.250905 0.250931 0.259495 0.259507 0.262101 0.262099
chargesum: 0.00000
title: Mulliken charges with hydrogens summed into heavy atoms:
elementType: Cl O O N N N N C C C C C C C C C C C C C
charge: -0.036610 -0.255950 -0.267097 -0.289610 -0.151087 -0.223683 -0.085625 0.101596 0.089321 0.177981 0.217525 0.446487 0.060887 0.156463 0.170563 -0.079161 -0.079272 0.080183 0.080134 -0.113044
polarizability: 2.71284266e+02 -1.38160514e+01 1.63307931e+02 3.06473058e-02 6.25730928e-02 1.18909900e+02
1716.lowfreq: -35.4214 -7.4736 -6.0469 0.0006 0.0009 0.0012 3.9789 33.9143 34.7246
frequency: -35.2382 33.9095 34.7246 85.5932 91.4614 92.7670 112.6049 124.9815 148.5470 156.1901 218.3702 257.1570 266.1567 288.9624 299.5311 336.9837 351.6107 380.6042 400.9717 410.0975 429.5703 430.7080 444.6388 503.5933 527.3931 570.2724 601.5374 643.5445 662.2949 669.3814 704.9040 712.5608 729.3626 742.8624 772.1972 812.8346 824.7758 832.8141 903.3922 947.7360 953.2925 966.1290 968.5822 1002.7501 1032.6307 1061.8590 1071.5913 1104.4058 1129.4491 1131.9817 1167.2579 1176.9710 1201.8143 1224.5359 1234.2971 1254.9789 1287.4575 1288.0602 1307.3652 1363.6877 1368.2468 1394.4074 1407.9168 1424.4618 1427.0996 1465.6799 1472.6799 1477.5800 1478.5542 1483.8875 1501.5422 1572.5183 1589.3114 1602.2263 1612.8992 1651.0391 3009.1689 3012.8689 3099.0876 3104.6375 3139.5685 3139.9140 3157.3701 3158.1024 3177.5582 3180.9716 3245.8411
redmass: 3.9504 7.7393 10.1668 2.9947 1.2756 1.0327 3.9518 8.1905 4.8143 6.8925 7.3495 7.8163 6.1418 5.3642 3.1783 6.4362 3.8291 8.6594 7.1986 2.9029 5.8208 7.4389 8.0744 5.1461 4.3225 7.0470 5.2244 5.8647 6.6013 8.2691 10.8131 3.9095 6.2988 9.8928 5.0787 1.4548 1.2423 1.5552 4.7654 5.0406 1.4923 1.3681 3.4911 3.7072 3.4341 3.5344 2.4483 1.3166 1.3035 1.2994 2.1344 1.1281 4.4145 2.8140 2.3625 5.6340 1.2481 5.9707 7.3470 5.1849 6.6461 3.5839 1.7470 1.4884 1.6033 1.7154 1.0434 1.0744 1.0420 2.2014 2.5140 8.2527 8.0415 6.5332 10.7733 10.4907 1.0334 1.0328 1.1025 1.1021 1.1024 1.1015 1.0899 1.0896 1.0968 1.0980 1.0993
irintensity: 0.0211 0.0000 0.1283 0.0424 0.8422 0.0028 3.8698 2.2371 1.3923 10.4042 0.6733 0.0037 6.9337 0.0211 0.5203 0.0068 15.0871 16.1513 6.9420 0.0155 0.5581 16.9010 16.3777 19.5395 10.8815 12.2502 6.2793 7.4716 17.8583 0.0305 9.6222 3.7720 2.1816 8.0968 3.7152 19.6076 0.8274 58.0818 24.2674 4.7901 3.9936 0.1504 106.4744 15.3465 62.8457 19.3791 41.1828 10.8079 0.2459 0.1678 59.6399 1.7850 11.5322 14.1769 58.3213 8.9183 0.1722 69.6660 7.2829 10.7277 0.5678 6.6161 31.3215 76.4399 93.9748 66.8642 17.3263 8.0495 17.1399 242.0388 69.6180 3.8415 0.0552 8.9907 740.0481 351.6157 37.8888 25.6506 16.8656 16.4921 0.8032 0.3850 0.4873 5.2594 2.4621 0.0555 1.8307
temp: 298.150 k
press: 1.00000 atm
elementType: 17 8 8 7 7 7 7 6 6 6 6 6 6 6 6 6 6 6 6 6 1 1 1 1 1 1 1 1 1 1 1
symmnumber: 1
zpe: 591205.5 jmol-1
zpe.correction: 0.225178 hartree
zpe.thermalcorrener: 0.242036 hartree
zpe.thermalcorrenthalpy: 0.242980 hartree
zpe.thermalcorrgfe: 0.179465 hartree
zpe.sumelectzpe: -1330.118161 hartree
zpe.sumelectthermal: -1330.101303 hartree
zpe.sumelectthermalent: -1330.100359 hartree
zpe.sumelectthermalfe: -1330.163875 hartree
dipole: -1.6391 -2.5934 0.0018
dipole: 3.0680
quadrupole: -138.0310 -125.5536 -112.7171
quadrupole: 0.5325 0.0066 0.0329
quadrupole: -12.5971 -0.1197 12.7168 0.5325 0.0066 0.0329
hfenergy: -1330.3433394 hartree
pointgroup: C01 [X(C13H11Cl1N4O2)]
dipole: -0.6723204 1.0024464 0.0000229 debye
polarizability: 270.4548735|16.7257497|164.1372132|-0.0285798|0.0923108|118.9100098 unknown
InChI: InChI=1S/C13H11ClN4O2/c1-16-11-10(12(19)17(2)13(16)20)18(7-15-11)9-5-3-8(14)4-6-9/h3-7H,1-2H3
charge 0 multiplicity 1
31 atoms
Cl -6.194589 -0.846385 0.000082
O  0.029589 -2.102907 -0.000543
O  4.631787 -1.061802 -0.000019
N  -0.426937 1.00776 0.000167
N  3.126758 0.739938 0.000157
N  2.337228 -1.543512 -0.00032
N  1.346649 2.455845 0.000414
C  0.741777 0.219267 -0.000156
C  1.801607 1.141412 0.000135
C  0.930652 -1.211425 -0.00044
C  3.439996 -0.641354 -0.000012
C  -1.800379 0.549751 0.000151
C  -0.003262 2.332098 0.00046
C  4.21461 1.737524 0.000412
C  2.700091 -2.980047 -0.000466
C  -2.464046 0.335163 -1.22742
C  -2.465748 0.340415 1.227708
C  -3.809038 -0.091004 -1.232156
C  -3.810772 -0.0857 1.232417
C  -4.461951 -0.294505 0.00012
H  -0.70407 3.162978 0.000624
H  5.167139 1.188247 0.000913
H  4.141645 2.377055 0.895752
H  4.142449 2.376703 -0.895252
H  1.762704 -3.554867 -0.00153
H  3.300069 -3.218194 0.892947
H  3.30183 -3.217488 -0.892863
H  -1.931993 0.488567 -2.171268
H  -1.934971 0.49782 2.17162
H  -4.335792 -0.265496 -2.174376
H  -4.338831 -0.256154 2.174647
