program: Gaussian 09
title: 000215885
version: EM64L-G09RevD.01
frameworkgroup: C1[X(C12H13NS)]
method: RPBEPBE
basis: SDD
operation: Freq
keyword: #p
keyword: freq=noraman
keyword: PBEPBE/SDD
title: #p freq=noraman PBEPBE/SDD
converged: YES YES NO NO
title: Mulliken charges:
elementType: S N C C C C C C C C C C C C H H H H H H H H H H H H H
charge: 0.231218 -0.025006 -0.198039 -0.380573 -0.458817 -0.453218 -0.417782 -0.101428 -0.182572 -0.258122 -0.201801 -0.217844 -0.218486 -0.226701 0.254368 0.227671 0.244918 0.248820 0.242261 0.218287 0.216281 0.240705 0.251400 0.264326 0.231680 0.235690 0.232764
chargesum: 0.00000
title: Mulliken charges with hydrogens summed into heavy atoms:
elementType: S N C C C C C C C C C C C C
charge: 0.231218 -0.025006 -0.198039 0.101466 0.034921 0.007330 0.039205 -0.101428 -0.182572 -0.006722 0.062525 0.013836 0.017204 0.006063
polarizability: 1.83598212e+02 -1.09239003e-01 1.39358739e+02 1.60240208e+01 -3.34991395e+00 1.07301790e+02
1716.lowfreq: -9.4437 -0.0025 -0.0024 -0.0013 4.9720 12.7004 23.7306 41.1101 49.5943
frequency: 22.9498 41.0164 48.9410 64.3562 119.3361 159.3503 167.2577 191.5730 240.4749 275.6255 326.0668 395.5148 405.8489 412.2138 472.9559 506.2431 545.2900 610.5060 636.8722 678.1934 683.1358 697.8513 756.6356 792.0029 809.2607 822.8633 851.7249 885.5915 927.9934 939.6744 953.3494 978.8996 986.2801 998.6890 1003.9187 1015.2662 1042.3118 1066.6424 1072.6430 1074.4505 1102.8989 1172.5436 1178.7384 1185.0217 1191.7569 1225.5159 1245.4174 1271.4441 1301.0717 1302.8625 1306.4560 1313.5456 1372.7497 1425.0396 1458.6545 1459.8767 1469.3584 1472.3537 1488.6037 1585.3068 1586.4618 2171.0152 3007.6337 3011.5964 3014.7357 3025.3289 3061.5104 3081.9684 3093.6971 3101.7504 3128.9067 3139.5466 3151.7763 3161.7954 3172.5535
redmass: 4.6997 3.1446 2.2021 4.9119 4.4755 4.3125 2.9903 4.7635 4.8920 5.3723 3.5138 4.2303 3.3004 7.1616 5.5403 5.0713 4.6443 6.4716 3.0525 6.3367 2.4680 2.1348 1.5435 1.5084 2.0996 2.6736 1.2399 3.0896 1.3782 2.0490 2.2919 1.4006 6.0578 1.3301 1.8277 3.4714 1.6425 2.4974 1.8205 2.0262 4.7847 1.0547 1.3218 1.1142 1.3165 1.2279 1.5974 1.2628 1.2289 1.3113 1.3815 1.4254 9.4441 2.0814 2.0363 1.0891 1.0812 1.0799 1.0923 6.2245 5.9911 12.6390 1.0599 1.0621 1.0624 1.0652 1.1027 1.1026 1.1025 1.1043 1.0851 1.0887 1.0934 1.0970 1.1005
irintensity: 1.7599 0.4194 0.2828 2.0907 2.1496 0.6969 0.3783 3.0100 0.9974 0.7732 0.3789 1.0648 0.4353 0.1785 5.8912 8.3749 1.3326 0.1169 1.1466 5.3054 3.0864 44.9877 59.9572 8.1525 4.5230 12.3685 0.3544 7.3518 2.3996 2.3006 4.2753 0.5060 4.0608 0.0876 1.4986 10.9044 3.4732 1.7505 4.7049 4.0794 0.7789 0.0278 8.7597 1.4579 1.1840 3.1212 2.5040 0.5782 5.8696 1.0732 3.2115 3.8162 1.2897 10.8172 24.2845 3.5538 8.1338 10.4430 3.7327 1.7693 4.2529 10.0812 2.2741 36.9376 24.4244 42.9803 6.3115 15.4000 14.8789 39.1585 0.3206 6.0643 19.6804 20.0397 11.7430
temp: 298.150 k
press: 1.00000 atm
elementType: 16 7 6 6 6 6 6 6 6 6 6 6 6 6 1 1 1 1 1 1 1 1 1 1 1 1 1
symmnumber: 1
zpe: 568939.5 jmol-1
zpe.correction: 0.216698 hartree
zpe.thermalcorrener: 0.230110 hartree
zpe.thermalcorrenthalpy: 0.231054 hartree
zpe.thermalcorrgfe: 0.174546 hartree
zpe.sumelectzpe: -916.851539 hartree
zpe.sumelectthermal: -916.838127 hartree
zpe.sumelectthermalent: -916.837183 hartree
zpe.sumelectthermalfe: -916.893691 hartree
dipole: 0.1351 -3.4058 -0.7689
dipole: 3.4941
quadrupole: -75.9963 -94.1600 -93.6591
quadrupole: -4.6987 4.7710 4.0139
quadrupole: 11.9421 -6.2215 -5.7206 -4.6987 4.7710 4.0139
hfenergy: -917.0682369 hartree
pointgroup: C01 [X(C12H13N1S1)]
dipole: 0.0651413 -1.3601957 -0.1881099 debye
polarizability: 183.5215033|1.6409532|138.5906108|16.1488165|-5.860695|108.1466279 unknown
InChI: InChI=1S/C12H13NS/c13-10-12(8-4-5-9-12)14-11-6-2-1-3-7-11/h1-3,6-7H,4-5,8-9H2
charge 0 multiplicity 1
27 atoms
S  0.182767 -0.185071 1.730444
N  1.171962 2.46877 -0.749328
C  1.522494 0.069788 0.359083
C  1.54668 -1.057293 -0.709573
C  2.928807 -0.055933 1.022739
C  2.975739 -0.956252 -1.312635
C  3.886362 -0.409128 -0.157612
C  1.32814 1.394583 -0.249386
C  -1.371975 -0.193843 0.729717
C  -1.979656 -1.429885 0.403943
C  -1.978683 1.026921 0.349604
C  -3.201428 -1.443003 -0.308271
C  -3.194046 1.006011 -0.373005
C  -3.8071 -0.226097 -0.700385
H  0.741534 -0.958491 -1.455474
H  1.410568 -2.017173 -0.177501
H  2.881308 -0.886884 1.751117
H  3.221021 0.85812 1.564715
H  2.978852 -0.253779 -2.164797
H  3.319174 -1.934241 -1.691856
H  4.635707 -1.153515 0.163347
H  4.437771 0.486077 -0.493042
H  -1.503291 -2.366321 0.712365
H  -1.506411 1.977374 0.616256
H  -3.67565 -2.399164 -0.555534
H  -3.66043 1.950669 -0.672699
H  -4.752716 -0.238139 -1.253832
