program: Gaussian 09
title: 000215889
version: EM64L-G09RevD.01
frameworkgroup: C1[X(C10H10N2O2)]
method: RPBEPBE
basis: SDD
operation: Freq
keyword: #p
keyword: freq=noraman
keyword: PBEPBE/SDD
title: #p freq=noraman PBEPBE/SDD
converged: YES YES NO NO
title: Mulliken charges:
elementType: O O N N C C C C C C C C C C H H H H H H H H H H
charge: -0.213935 -0.229777 -0.127094 -0.503570 -0.371011 -0.547155 0.541843 0.160881 0.190554 -0.450106 -0.367028 -0.215105 -0.228113 -0.243232 0.261731 0.278615 0.264608 0.229743 0.233390 0.322382 0.322047 0.229301 0.228982 0.232047
chargesum: 0.00000
title: Mulliken charges with hydrogens summed into heavy atoms:
elementType: O O N N C C C C C C C C C C
charge: -0.213935 -0.229777 -0.127094 0.140859 -0.109280 -0.003932 0.541843 0.160881 0.190554 -0.220363 -0.133638 0.014196 0.000869 -0.011185
polarizability: 1.67062958e+02 7.58092147e+00 1.00440510e+02 -9.07871170e+00 -6.93685934e-01 1.05450590e+02
1716.lowfreq: -0.4428 -0.0007 -0.0006 0.0006 3.8757 7.6429 20.2450 32.8753 79.2122
frequency: 20.1850 32.6163 79.2105 128.4278 180.9725 185.0552 244.2282 273.4500 284.9467 293.0441 349.2093 403.1851 485.8363 519.5819 542.2394 550.9613 590.2919 605.5873 612.2054 636.5820 686.0394 704.5764 749.5058 785.0327 802.2176 851.5343 920.3961 952.2194 975.1640 975.9957 991.6982 997.2649 1023.6879 1032.4255 1083.3729 1089.7710 1148.1333 1152.0630 1173.8645 1190.7214 1209.7179 1236.4260 1264.9491 1283.0257 1339.3770 1381.4974 1385.4501 1397.6369 1443.1055 1451.8980 1483.7870 1570.9275 1596.1760 1607.5004 1615.5946 1689.8422 3019.0068 3027.2477 3085.3913 3114.7455 3120.3102 3134.9704 3147.8140 3165.6222 3460.0396 3618.7649
redmass: 5.0149 4.2852 5.5502 9.4520 1.5743 2.2080 5.0707 4.8052 5.3139 2.2976 8.3732 2.8042 3.8785 5.6666 2.3231 2.1407 4.1607 3.5289 6.2993 6.2656 4.8467 1.7185 2.6105 2.6921 4.0290 1.2491 1.4516 2.1306 2.8901 1.4027 5.7464 1.3421 2.7304 2.3828 1.6610 6.1073 3.2452 1.2430 1.0545 1.1159 1.8509 1.3367 1.4622 1.8126 1.3013 2.3427 4.9212 7.5142 1.7923 1.2374 2.3111 1.2197 6.0624 10.1585 6.7192 5.5254 1.0818 1.0631 1.1020 1.0883 1.0873 1.0903 1.0956 1.1014 1.0408 1.1054
irintensity: 0.0544 0.1106 0.9950 11.5537 20.4786 4.4440 2.3014 3.9106 3.3739 3.5631 15.5530 0.0314 5.1343 1.5565 128.7197 100.6347 65.2336 18.1762 4.1549 19.7058 23.8595 48.9274 22.5364 20.3044 19.5836 0.0618 0.8692 8.4511 8.2319 0.4322 3.2492 0.1486 0.5714 9.8838 7.1012 83.1451 172.3092 7.9280 0.1365 0.1293 2.3431 0.4709 1.1759 1.3783 1.6420 56.5325 15.3505 12.2736 10.7027 6.7850 17.8000 127.0135 3.4911 555.0788 160.2638 6.7897 9.5294 7.3023 6.1044 8.2547 6.9158 7.7270 34.4903 21.9972 32.5159 42.6286
temp: 298.150 k
press: 1.00000 atm
elementType: 8 8 7 7 6 6 6 6 6 6 6 6 6 6 1 1 1 1 1 1 1 1 1 1
symmnumber: 1
zpe: 485410.7 jmol-1
zpe.correction: 0.184883 hartree
zpe.thermalcorrener: 0.197166 hartree
zpe.thermalcorrenthalpy: 0.198110 hartree
zpe.thermalcorrgfe: 0.144674 hartree
zpe.sumelectzpe: -646.004433 hartree
zpe.sumelectthermal: -645.992150 hartree
zpe.sumelectthermalent: -645.991206 hartree
zpe.sumelectthermalfe: -646.044643 hartree
dipole: 1.2276 -0.6416 -1.4942
dipole: 2.0375
quadrupole: -73.5636 -92.9726 -75.3148
quadrupole: -10.2272 3.2613 2.0658
quadrupole: 7.0534 -12.3556 5.3022 -10.2272 3.2613 2.0658
hfenergy: -646.1893163 hartree
pointgroup: C01 [X(C10H10N2O2)]
dipole: 0.4732111 -0.4515426 -0.4634142 debye
dipolederiv: -0.5678413 -0.0444765 0.0653732 -0.2965504 -1.023025 0.4110817 0.1768791 0.2188754 -0.4616574 -1.0144003 -0.5114413 0.2769961 -0.1782628 -0.6973248 0.1459903 0.3178289 0.2968908 -0.4920569 -0.4103147 -0.7986802 0.2280727 -0.7851842 -0.7771766 0.5675359 0.4039033 0.4913972 -0.2630974 -0.5232309 0.2095672 -0.0186589 0.3035246 -0.4481368 -0.1980041 0.126202 -0.2569992 -0.5074805 -0.0907873 0.1393527 0.008878 0.0969922 -0.0947086 0.038517 0.134924 0.0006756 0.1741673 -0.3105334 0.0818447 0.0781826 0.1849812 -0.0365995 0.0246665 0.0172879 0.0374233 0.0589248 0.38711 -0.0063465 0.0807749 0.0891575 -0.0670811 0.0010556 0.1193873 0.0071301 -0.0144747 1.1445286 0.4407778 -0.4370668 0.2255335 1.1362058 -0.54431 -0.5982497 -0.4637861 0.4701825 1.0576931 0.4395474 -0.3484718 0.4737195 1.4010026 -0.4787618 -0.4753459 -0.4739041 0.4105759 -0.1724976 0.0013229 0.0107802 -0.0079655 -0.1284355 0.0474088 -0.0400772 0.0632553 0.0760864 -0.0963577 -0.0213594 -0.0755276 -0.0472506 -0.1157896 0.032314 -0.1063082 0.0215809 -0.0500969 0.062827 -0.0205632 -0.0831394 -0.0259062 -0.123367 0.0395801 -0.0913278 0.0392217 0.0078007 -0.0369888 0.0008061 0.0118782 0.0084344 -0.1169244 0.0780006 0.0345674 0.0738427 0.1143411 0.0565201 0.0171249 0.0648626 0.0184335 -0.1574783 0.0285068 0.0513598 0.0264586 -0.0627379 0.0444153 0.0042959 0.0556224 0.0256569 0.0528863 -0.0313799 -0.0062298 -0.0119052 -0.0808755 0.0670208 0.0708267 -0.0446103 0.054799 0.0812508 0.0250127 -0.0448641 0.0534903 -0.0067122 0.0361603 -0.0267833 -0.0054722 -0.0598476 -0.0082888 -0.0600183 -0.0015269 -0.1131582 0.0416477 0.0874859 -0.0182185 -0.063048 -0.0100693 0.1252222 -0.0604363 -0.035828 -0.0638406 -0.0881058 -0.0423541 0.025886 0.0914264 0.0267723 0.1173254 -0.0224082 0.1066757 -0.0222746 0.0475514 0.2103785 0.0111915 0.0885239 -0.0257964 0.2796499 0.0643518 0.0046023 0.147613 0.2591039 0.2136726 -0.001058 0.0168912 -0.067333 0.1682212 0.0258411 -0.0738154 0.0609773 0.373843 -0.0657275 0.0284649 0.0922125 0.0273069 0.1449739 -0.0385079 0.1024459 -0.0382403 0.0198916 0.0673445 -0.0049086 -0.0223623 -0.0113815 0.1332503 -0.0702285 -0.0457175 -0.0689369 -0.0929714 -0.1041231 -0.0171734 -0.0721179 -0.019764 0.1543478 -0.025808 -0.0767728 -0.0257869 0.0661502 unknown
polarizability: 167.5427757|1.7158673|100.357076|-10.2531852|1.4576375|105.0542054 unknown
InChI: InChI=1S/C10H10N2O2/c11-12-9(13)6-8(10(12)14)7-4-2-1-3-5-7/h1-5,8H,6,11H2
charge 0 multiplicity 1
24 atoms
O  -0.881109 2.072965 -1.129274
O  -3.408873 -1.340643 0.797616
N  -2.282944 0.536191 -0.048563
N  -3.262592 1.467929 0.314275
C  -0.241302 -0.368205 -0.868326
C  -1.083428 -1.490005 -0.176996
C  1.169692 -0.196132 -0.307972
C  -1.102297 0.904483 -0.72366
C  -2.389149 -0.833801 0.262844
C  2.2996 -0.429346 -1.127427
C  1.36839 0.181874 1.045229
C  3.606956 -0.297715 -0.605798
C  2.672076 0.316202 1.567676
C  3.796858 0.074015 0.744015
H  -0.160444 -0.575092 -1.951745
H  -0.566679 -1.903655 0.706268
H  -1.301514 -2.334789 -0.852103
H  2.157962 -0.710839 -2.178234
H  0.503261 0.383713 1.69027
H  -3.216157 2.312384 -0.263294
H  -4.172099 1.022681 0.467374
H  4.47272 -0.481513 -1.251586
H  2.812837 0.614269 2.61259
H  4.809131 0.179431 1.149521
