program: Gaussian 09
title: 000215740
version: EM64L-G09RevD.01
frameworkgroup: C1[X(C11H14N4O2)]
method: RPBEPBE
basis: SDD
operation: Freq
keyword: #p
keyword: freq=noraman
keyword: PBEPBE/SDD
title: #p freq=noraman PBEPBE/SDD
converged: YES YES NO NO
title: Mulliken charges:
elementType: O O N N N N C C C C C C C C C C C H H H H H H H H H H H H H H
charge: -0.214893 -0.214964 -0.190355 -0.086223 -0.020691 0.015245 -0.402149 -0.348963 0.319412 0.230912 -0.306485 -0.432062 -0.503708 0.405900 -0.360732 -0.615221 -0.611977 0.229429 0.254321 0.213971 0.221790 0.255552 0.276676 0.299797 0.286869 0.226944 0.195491 0.226992 0.228434 0.197247 0.223442
chargesum: 0.00000
title: Mulliken charges with hydrogens summed into heavy atoms:
elementType: O O N N N N C C C C C C C C C C C
charge: -0.214893 -0.214964 -0.190355 -0.086223 -0.020691 0.015245 0.081602 0.086797 0.319412 0.230912 -0.050933 -0.155386 -0.203911 0.405900 -0.073863 0.034206 0.037145
polarizability: 2.45604838e+02 1.95609395e+01 1.63547033e+02 -1.24928074e+01 1.46214179e+01 8.94242243e+01
1716.lowfreq: -5.0539 -0.0005 -0.0001 0.0001 1.6324 4.6456 18.2892 23.2151 41.9768
frequency: 17.3247 22.9688 41.9756 66.5032 87.3965 107.7075 169.7702 189.2408 205.9585 210.9338 232.9324 255.0968 283.8945 327.7630 346.9590 361.1831 412.4155 430.7672 441.9304 445.5765 527.1141 563.0929 575.9952 622.0532 650.4536 700.9680 730.3866 753.6617 758.1128 784.2042 813.3106 826.2982 834.2206 836.6038 926.2491 942.0150 951.4308 978.6363 1021.5366 1035.9692 1054.4125 1062.5331 1076.9383 1090.1857 1111.8866 1140.1577 1159.9087 1187.8385 1204.4827 1222.0189 1251.6787 1264.5040 1267.0753 1277.3391 1301.5429 1322.4994 1355.9159 1365.2859 1375.3113 1405.3859 1423.5270 1424.8063 1444.6097 1458.5128 1463.6773 1470.0259 1475.4772 1475.9755 1481.9734 1487.1199 1492.5871 1580.7680 1623.7650 2864.7289 2870.3534 2885.4095 3023.6371 3029.7340 3032.4177 3035.9537 3080.5591 3087.2042 3107.2643 3158.9661 3181.8083 3187.8783 3227.8360
redmass: 3.8464 3.1128 5.8883 8.9018 2.2440 5.7205 3.5492 3.2103 3.9266 1.1466 1.4100 3.1375 4.0248 4.1195 4.1951 3.9138 3.0099 3.0064 2.7667 3.8531 5.6578 4.5755 6.3887 6.2085 6.8279 5.1916 6.6864 3.6445 4.6844 1.3947 5.1713 1.4852 3.8114 1.5279 4.0749 1.4903 2.9289 1.3174 2.8957 1.6142 2.4500 2.2018 1.8384 1.3086 2.0862 1.4828 1.5508 2.0269 2.4360 4.0187 1.8204 2.5880 2.5137 1.8912 1.1993 1.3995 5.1772 3.9958 1.3709 3.4396 1.2139 4.2299 1.1550 1.1107 1.0785 1.0700 5.6046 1.0588 1.0906 1.0936 3.9989 7.9630 7.8802 1.0559 1.0607 1.0647 1.0743 1.0842 1.0770 1.0625 1.1012 1.1008 1.1039 1.0901 1.0931 1.0957 1.0979
irintensity: 0.4604 0.1714 0.5774 0.4744 1.0113 2.3274 0.2926 2.5649 0.6151 0.6562 0.7847 1.5455 2.4502 4.7347 4.7363 8.5184 6.3365 4.3773 2.6936 1.1910 1.5401 0.2063 4.0752 6.1298 8.4713 13.8705 37.0448 7.1304 11.5724 2.0131 2.7571 43.7432 17.1723 18.5155 6.9587 30.8203 4.4655 1.3689 9.2795 22.2723 43.1716 68.3200 16.0475 6.5593 12.0654 8.7921 31.5580 136.8945 46.1364 287.3407 1.1356 13.9139 28.1106 8.3058 6.8317 1.8135 32.9451 81.2353 2.1921 47.6992 11.2126 29.8193 1.2673 5.1447 11.9746 9.1869 2.6936 22.0566 22.1592 7.5715 20.2529 1.1347 91.2763 64.5001 106.4541 148.7015 37.0309 30.4453 7.4313 44.2921 23.6008 55.3708 10.8995 3.8558 1.8044 5.3339 0.8532
temp: 298.150 k
press: 1.00000 atm
elementType: 8 8 7 7 7 7 6 6 6 6 6 6 6 6 6 6 6 1 1 1 1 1 1 1 1 1 1 1 1 1 1
symmnumber: 1
zpe: 640385.4 jmol-1
zpe.correction: 0.243910 hartree
zpe.thermalcorrener: 0.259856 hartree
zpe.thermalcorrenthalpy: 0.260800 hartree
zpe.thermalcorrgfe: 0.197946 hartree
zpe.sumelectzpe: -795.653072 hartree
zpe.sumelectthermal: -795.637126 hartree
zpe.sumelectthermalent: -795.636182 hartree
zpe.sumelectthermalfe: -795.699036 hartree
dipole: 6.7140 0.0798 -0.0656
dipole: 6.7148
quadrupole: -122.4545 -100.0376 -100.4540
quadrupole: -11.4025 3.2614 0.7414
quadrupole: -14.8058 7.6111 7.1947 -11.4025 3.2614 0.7414
hfenergy: -795.896982 hartree
pointgroup: C01 [X(C11H14N4O2)]
dipole: 2.6342203 0.1542558 -0.1270681 debye
polarizability: 248.3005594|-13.2984241|145.3916291|-4.2621443|34.5577629|104.8839073 unknown
InChI: InChI=1S/C11H14N4O2/c1-13(2)5-6-14-11-4-3-10(15(16)17)7-9(11)8-12-14/h3-4,7-8H,5-6H2,1-2H3
charge 0 multiplicity 1
31 atoms
O  -4.690761 1.506893 0.993983
O  -5.11767 -0.309368 -0.318895
N  1.122799 -0.909467 0.087421
N  4.296978 1.17322 0.058456
N  1.092946 -2.05931 -0.724139
N  -4.308548 0.467862 0.324645
C  2.414145 -0.386052 0.544129
C  3.007684 0.653907 -0.441766
C  -0.143141 -0.38233 0.274886
C  -1.051536 -1.244705 -0.441628
C  -0.593989 0.7496 1.003643
C  -0.211691 -2.256076 -1.033589
C  -2.437843 -0.973059 -0.431634
C  -2.86443 0.153125 0.294754
C  -1.968753 1.010647 1.007285
C  4.613354 2.525384 -0.449018
C  5.421842 0.234188 -0.141595
H  2.290483 0.08321 1.53532
H  3.088276 -1.250128 0.653654
H  3.089539 0.184919 -1.453641
H  2.301114 1.500227 -0.530931
H  0.099568 1.398386 1.546327
H  -0.494497 -3.103502 -1.655304
H  -3.169556 -1.592908 -0.955935
H  -2.386418 1.864108 1.547194
H  3.789243 3.219391 -0.206693
H  4.783827 2.55912 -1.554174
H  5.5277 2.898711 0.04593
H  6.329331 0.640156 0.338872
H  5.650166 0.052505 -1.221808
H  5.204339 -0.740356 0.32795
