program: Gaussian 09
title: 000215796
version: EM64L-G09RevD.01
frameworkgroup: C1[X(C13H26Cl3O4P)]
method: RPBEPBE
basis: SDD
operation: Freq
keyword: #p
keyword: freq=noraman
keyword: PBEPBE/SDD
title: #p freq=noraman PBEPBE/SDD
converged: YES YES NO NO
title: Mulliken charges:
elementType: Cl Cl Cl P O O O O C C C C C C C C C C C C C H H H H H H H H H H H H H H H H H H H H H H H H H H
charge: 0.076982 0.073863 0.083464 1.412423 -0.526087 -0.530016 -0.511198 -0.612404 -0.389643 -0.373708 -0.376039 -0.361800 -0.345547 -0.397938 -0.258201 -0.274028 -0.614395 -0.240386 -0.265021 -0.639686 -0.650655 0.204265 0.197664 0.186556 0.195341 0.198734 0.196802 0.235120 0.185974 0.217343 0.220114 0.199287 0.213850 0.253935 0.255184 0.234543 0.229162 0.225629 0.230122 0.225387 0.240820 0.228424 0.246754 0.209603 0.222488 0.249062 0.217857
chargesum: 0.00000
title: Mulliken charges with hydrogens summed into heavy atoms:
elementType: Cl Cl Cl P O O O O C C C C C C C C C C C C C
charge: 0.076982 0.073863 0.083464 1.412423 -0.526087 -0.530016 -0.511198 -0.612404 0.012286 0.008189 0.019497 0.059294 0.091910 0.015199 0.250917 0.189677 -0.614395 0.215365 0.201186 0.045095 0.038753
polarizability: 2.50830261e+02 -1.05097837e+01 1.98080171e+02 7.61886325e+00 1.84465498e+00 1.84179974e+02
1716.lowfreq: -6.0238 0.0012 0.0027 0.0030 2.3376 4.0204 10.8960 12.1174 14.8068
frequency: 7.3366 11.7396 14.6948 21.9355 30.7367 36.8891 41.3216 52.5691 63.4114 74.2705 79.8011 83.3483 95.7300 108.6847 127.4952 136.3149 154.0229 158.4385 166.0235 174.6539 191.9148 224.5154 226.7190 229.7925 241.2612 249.2611 253.1840 272.0360 323.1465 325.3046 327.5476 348.6171 365.8633 379.3952 405.5483 435.4339 445.3085 457.2579 517.4814 545.8332 576.3620 622.8524 670.9397 694.7156 714.0419 727.6251 742.3762 775.3673 803.9075 804.0505 827.6080 851.9581 871.5395 877.1231 886.4048 929.5851 985.7109 997.7403 1008.8871 1010.6461 1018.9945 1035.7681 1055.7563 1059.8325 1078.5500 1081.8041 1091.7270 1094.9084 1095.2943 1103.0597 1135.0271 1142.5314 1146.7197 1147.6485 1196.1180 1216.8871 1232.2074 1259.6842 1263.7885 1271.0391 1271.8832 1286.1882 1290.8092 1299.2777 1302.5724 1309.6037 1339.8819 1347.4666 1353.2630 1354.4099 1356.0881 1359.9833 1367.0600 1391.6141 1393.2869 1435.2730 1446.0842 1457.1927 1462.0613 1463.1188 1463.9015 1464.5899 1471.2949 1475.3821 1476.3314 1479.6369 1481.0770 1487.8496 1488.2101 2950.3407 2954.7270 2963.3354 2968.4674 2972.4450 2987.2016 2989.8905 2990.6880 2992.1134 2996.4309 3000.1452 3002.1984 3004.3193 3012.9370 3024.2233 3031.5869 3047.9516 3055.6758 3070.2078 3071.5732 3077.7880 3078.7170 3084.8655 3086.7946 3107.4866 3111.8847
redmass: 5.3401 7.7314 5.6446 3.4414 4.4661 3.9456 4.1831 3.2110 2.9060 2.3617 4.6498 2.2489 5.8623 4.2843 2.4316 2.2291 2.6253 2.3756 2.5801 3.8380 4.3438 2.7966 8.0968 1.5510 1.8196 4.6749 2.5337 4.2234 4.7599 3.5176 8.6969 5.3545 4.9650 5.7634 4.1150 3.7650 3.7251 4.1104 3.4433 4.9631 6.1326 4.1723 7.0801 3.0691 8.9513 1.0732 1.1781 1.3373 1.1218 1.1121 1.4549 3.5006 3.4739 2.3669 1.9101 1.7754 3.2706 1.6618 2.8716 3.9815 3.1256 2.5106 5.1972 4.9054 2.4434 2.1626 2.1613 2.1653 3.6683 3.0140 1.7572 1.5399 1.4336 1.5220 1.2274 1.3993 1.2708 1.2876 1.1225 1.2560 1.1191 1.0273 1.1725 1.0733 1.1398 1.2603 1.3664 1.2210 1.2157 1.4112 1.3941 1.5307 1.6229 1.2306 1.2262 1.0798 1.0827 1.0400 1.0526 1.0709 1.0714 1.0642 1.0842 1.0720 1.0763 1.0605 1.0967 1.0998 1.0635 1.0591 1.0589 1.0602 1.0621 1.0638 1.0358 1.0366 1.0953 1.0600 1.0578 1.0588 1.0995 1.0624 1.0612 1.0965 1.1034 1.1020 1.1030 1.1077 1.1043 1.1031 1.1022 1.0982 1.0973 1.1048 1.1029
irintensity: 0.2633 0.1575 0.0459 1.5638 1.2303 0.7952 0.3534 0.0762 2.7414 0.5010 0.3431 1.2607 0.9755 1.3997 0.2443 0.4037 4.5369 0.9402 7.7672 1.4261 0.7978 1.1126 0.1683 1.2554 2.9420 0.4385 1.2858 23.7296 10.3208 1.9388 3.2031 6.7044 1.7583 8.8655 10.8177 5.3382 19.5974 28.3659 2.4252 25.7633 24.5966 106.5780 149.5564 106.2460 144.6689 14.4983 10.6835 22.7338 4.6746 3.3775 30.9377 135.8923 164.7719 61.2306 67.9134 116.3690 24.6206 18.0049 185.5788 15.7035 78.4417 14.6642 96.2546 44.0389 11.4825 7.4049 9.8797 12.7204 34.4204 1.0527 20.3581 4.8233 14.7659 3.3346 19.8265 12.8089 10.6574 1.2142 0.5059 3.5470 0.1550 1.1417 6.4506 1.2534 1.3300 9.9048 5.4520 13.8779 7.1623 2.8944 4.0550 4.2216 0.5242 31.6961 23.9758 4.1232 6.0396 10.6995 10.1046 0.1355 0.4705 6.7808 1.5992 6.5098 5.3784 16.4807 0.1834 24.5130 14.8564 6.8794 5.7783 33.6625 13.0139 69.4510 14.2336 17.7365 7.3394 6.3630 32.2698 28.6802 0.7900 31.4783 32.4292 23.8481 14.9753 3.1339 72.1775 41.0150 59.1194 4.2591 7.1170 30.1455 34.0188 32.2071 32.7544
temp: 298.150 k
press: 1.00000 atm
elementType: 17 17 17 15 8 8 8 8 6 6 6 6 6 6 6 6 6 6 6 6 6 1 1 1 1 1 1 1 1 1 1 1 1 1 1 1 1 1 1 1 1 1 1 1 1 1 1
symmnumber: 1
zpe: 997213.1 jmol-1
zpe.correction: 0.379818 hartree
zpe.thermalcorrener: 0.408214 hartree
zpe.thermalcorrenthalpy: 0.409158 hartree
zpe.thermalcorrgfe: 0.312494 hartree
zpe.sumelectzpe: -2531.535707 hartree
zpe.sumelectthermal: -2531.507311 hartree
zpe.sumelectthermalent: -2531.506367 hartree
zpe.sumelectthermalfe: -2531.603031 hartree
dipole: 4.3316 1.4136 -3.9302
dipole: 6.0172
quadrupole: -164.4400 -146.0796 -163.8090
quadrupole: -4.3875 -4.6810 0.3092
quadrupole: -6.3304 12.0300 -5.6995 -4.3875 -4.6810 0.3092
hfenergy: -2531.9155251 hartree
pointgroup: C01 [X(C13H26Cl3O4P1)]
dipole: -1.7578845 0.5803058 1.475638 debye
polarizability: 245.817444|19.9708324|202.0885026|2.9617925|-4.6460851|185.1844593 unknown
InChI: InChI=1S/C13H26Cl3O4P/c1-3-18-21(17,19-4-2)20-12-10-8-6-5-7-9-11-13(14,15)16/h3-12H2,1-2H3
charge 0 multiplicity 1
47 atoms
Cl 7.365613 0.521046 -2.36673
Cl 8.043151 -0.29306 0.478047
Cl 8.781073 2.466618 -0.526903
P  -4.28907 -1.102063 -0.48992
O  -2.833659 -0.358168 0.014649
O  -4.309851 -2.476784 0.543085
O  -5.592109 -0.164522 0.187061
O  -4.387473 -1.322633 -2.056623
C  2.451461 0.397046 0.399696
C  1.17402 1.030558 0.994788
C  3.668665 1.348151 0.42651
C  -0.048449 0.088188 0.941265
C  4.949261 0.692792 -0.140666
C  -1.314286 0.719785 1.56038
C  6.134907 1.682431 -0.12093
C  -2.549671 -0.17636 1.475586
C  7.472157 1.125323 -0.600733
C  -5.351782 -3.531013 0.335921
C  -6.209432 0.88192 -0.688308
C  -6.537819 -3.313949 1.276803
C  -5.328196 2.129096 -0.801256
H  2.251642 0.084383 -0.645812
H  2.696428 -0.528956 0.960159
H  1.369081 1.327779 2.047118
H  0.938523 1.965803 0.44494
H  3.42993 2.263595 -0.154005
H  3.853317 1.677783 1.470283
H  -0.264616 -0.188396 -0.107933
H  0.189142 -0.85545 1.475576
H  5.203193 -0.204222 0.455785
H  4.766998 0.352164 -1.177546
H  -1.136775 0.945006 2.633006
H  -1.538882 1.682737 1.061421
H  6.29507 2.058533 0.908234
H  5.904033 2.558969 -0.756901
H  -2.37358 -1.174264 1.916948
H  -3.430965 0.28983 1.955888
H  -5.657865 -3.53823 -0.727954
H  -4.818434 -4.4706 0.556718
H  -7.16264 1.098158 -0.178443
H  -6.412297 0.440595 -1.682045
H  -6.203669 -3.311957 2.328415
H  -7.035798 -2.352113 1.067941
H  -7.272259 -4.131516 1.146976
H  -5.098231 2.540281 0.197078
H  -4.379105 1.90281 -1.318513
H  -5.857249 2.906677 -1.383651
