program: Gaussian 09
title: 000215783
version: EM64L-G09RevD.01
frameworkgroup: C1[X(C19H24N4O)]
method: RPBEPBE
basis: SDD
operation: Freq
keyword: #p
keyword: freq=noraman
keyword: PBEPBE/SDD
title: #p freq=noraman PBEPBE/SDD
converged: YES YES NO NO
title: Mulliken charges:
elementType: O N N N N C C C C C C C C C C C C C C C C C C C H H H H H H H H H H H H H H H H H H H H H H H H
charge: -0.349168 -0.077796 -0.176915 -0.390338 -0.635986 -0.361682 -0.366294 -0.382672 -0.404528 -0.337084 -0.455986 0.469354 -0.377943 -0.380897 0.294146 -0.234163 -0.225817 -0.268722 0.134957 -0.349148 -0.297447 -0.235263 -0.300434 0.190777 0.187069 0.211254 0.201116 0.190941 0.215897 0.205525 0.215631 0.210415 0.210074 0.217882 0.246399 0.211238 0.362364 0.231681 0.216229 0.217784 0.218445 0.225118 0.233363 0.185995 0.224117 0.228016 0.317107 0.335390
chargesum: 0.00000
title: Mulliken charges with hydrogens summed into heavy atoms:
elementType: O N N N N C C C C C C C C C C C C C C C C C C C
charge: -0.349168 -0.077796 -0.176915 -0.027975 0.016511 0.036641 0.025763 0.038750 0.021518 0.090872 0.001650 0.469354 -0.146261 -0.164668 0.294146 -0.016379 -0.007372 -0.043605 0.134957 -0.115785 -0.111452 -0.011146 -0.072418 0.190777
polarizability: 3.70717042e+02 1.11259822e+01 2.22245335e+02 9.82428376e+00 3.81161646e+00 1.56024947e+02
1716.lowfreq: -6.6253 -0.0010 -0.0006 -0.0004 2.5145 4.6264 15.3860 17.5107 23.8952
frequency: 15.3588 17.3659 23.3393 34.2988 45.4926 61.0132 78.8558 84.4903 119.6531 142.0473 179.2555 188.3310 224.5807 244.3599 263.4749 274.3877 282.7150 305.6256 333.2372 361.7571 390.4721 394.6262 402.4402 408.8924 434.6387 444.6987 456.0497 476.3246 513.9841 517.2844 525.4941 552.8327 559.3073 572.7889 613.8308 617.0392 631.0169 685.2626 690.9361 714.8115 718.3445 739.2953 755.8587 762.1447 779.3322 789.2127 815.9208 823.8100 831.9410 836.3335 843.3162 873.6999 918.5990 919.2739 948.8955 956.0274 969.9327 975.5361 977.8136 1001.0259 1028.4965 1031.3424 1036.2967 1043.8219 1051.0983 1061.5610 1071.0702 1079.5600 1088.8656 1098.6744 1111.5923 1140.0494 1148.8562 1161.4607 1171.0169 1180.4964 1188.7988 1199.7742 1206.1777 1233.2957 1242.1911 1265.6984 1273.8301 1294.0526 1302.0334 1316.7650 1326.9555 1339.3006 1344.3443 1347.2018 1352.8596 1361.2107 1367.1745 1377.4504 1385.2871 1394.9433 1409.2262 1422.8334 1445.8368 1451.3590 1455.3946 1456.4488 1460.4073 1467.0900 1475.6263 1487.6553 1495.8764 1518.7472 1557.3496 1578.7906 1596.8842 1618.0327 1621.0531 1633.8507 2849.9568 2861.5988 2879.2919 2908.5932 2921.4631 2985.9458 3031.3636 3036.9499 3039.9230 3053.7694 3067.7193 3091.3201 3118.7506 3120.7793 3127.2897 3129.9856 3149.2119 3157.6447 3157.7911 3168.9541 3169.8686 3241.2143 3542.0568 3696.0550
redmass: 5.2180 4.4268 3.6702 4.9664 4.5725 3.1143 4.0799 4.6052 4.8100 4.5617 4.3215 2.9578 3.2775 2.1478 3.1421 3.9438 3.1957 2.4635 4.7435 3.0713 4.4007 2.0516 2.5642 2.9087 3.9070 3.7621 1.5973 2.6993 3.6533 2.9660 2.9764 4.8258 1.2546 4.0549 5.9553 3.8902 2.5954 3.4437 1.7989 3.2895 3.9492 1.6431 1.8884 2.3300 3.4546 1.5185 1.3275 2.9222 1.6429 1.1826 1.5445 1.4939 1.4036 3.7874 2.2705 1.3823 1.3227 1.3020 5.2712 2.7590 2.4922 2.1994 2.7350 2.9887 1.8995 2.1910 2.6260 2.1696 1.6621 2.0996 2.6554 2.5452 2.3083 2.2517 1.0633 1.0982 1.8002 1.1406 1.1928 1.5184 1.5193 1.5350 1.3117 1.2856 1.2574 1.3422 1.3990 2.5861 1.4145 1.6994 1.4917 1.7941 1.4446 1.7236 2.7288 1.4692 5.8131 2.8204 2.4184 2.0073 1.1481 1.1142 1.1124 1.1145 1.1306 1.1206 2.3886 3.5081 3.3498 5.9215 2.0382 5.9930 1.7304 3.9806 1.0712 1.0700 1.0698 1.0689 1.0709 1.0653 1.0885 1.0878 1.0899 1.0903 1.1000 1.0892 1.0863 1.0843 1.0884 1.0881 1.0920 1.0928 1.0940 1.0995 1.0994 1.0819 1.0449 1.1037
irintensity: 0.1488 2.6857 0.5500 5.6638 2.3612 1.7330 0.6315 0.9329 1.1513 0.4666 0.4610 5.7544 2.2883 9.5308 4.6136 7.8379 3.1453 8.8363 4.1638 1.3205 6.4017 1.4416 9.2412 1.4853 2.9370 12.1800 118.4510 0.3429 4.7143 17.5872 13.1016 1.0648 107.9425 5.2784 1.0280 11.5551 28.2166 42.9399 41.4917 4.4346 4.5899 75.6625 75.2081 24.3825 2.0237 9.8521 0.3406 1.8586 58.8369 49.7177 3.0776 5.2486 0.3752 36.0888 5.3166 0.1190 0.3891 0.3926 8.7663 72.7984 0.2220 19.6319 9.7942 13.1631 8.5839 2.5395 2.9270 3.6297 5.2627 4.0899 0.6432 82.1909 22.8074 21.8444 0.4308 2.3842 35.3845 0.8672 3.6618 144.8741 56.3592 4.6343 22.9321 34.0089 14.5354 27.1506 1.5895 239.5075 18.1941 105.0539 27.9083 20.8117 3.8341 31.1171 14.3678 11.2166 115.3766 30.6492 0.7722 24.1704 0.6008 4.6216 52.9978 31.7008 4.8858 13.3386 148.1224 218.5451 14.8332 10.4713 426.3233 158.5541 68.6056 260.9759 45.4749 52.7441 125.1300 62.4544 98.3442 56.3618 2.9947 53.8721 50.7877 21.6130 34.8290 21.0243 18.8252 9.9694 9.6330 12.4096 40.7738 52.2563 30.1114 6.2394 16.0697 231.8132 60.5268 31.0247
temp: 298.150 k
press: 1.00000 atm
elementType: 8 7 7 7 7 6 6 6 6 6 6 6 6 6 6 6 6 6 6 6 6 6 6 6 1 1 1 1 1 1 1 1 1 1 1 1 1 1 1 1 1 1 1 1 1 1 1 1
symmnumber: 1
zpe: 1055119.7 jmol-1
zpe.correction: 0.401874 hartree
zpe.thermalcorrener: 0.423825 hartree
zpe.thermalcorrenthalpy: 0.424769 hartree
zpe.thermalcorrgfe: 0.347501 hartree
zpe.sumelectzpe: -1030.888181 hartree
zpe.sumelectthermal: -1030.866229 hartree
zpe.sumelectthermalent: -1030.865285 hartree
zpe.sumelectthermalfe: -1030.942553 hartree
dipole: -2.7393 1.1398 -0.6509
dipole: 3.0375
quadrupole: -123.3970 -141.8151 -144.7984
quadrupole: -6.2689 4.6135 5.7986
quadrupole: 13.2732 -5.1449 -8.1282 -6.2689 4.6135 5.7986
hfenergy: -1031.2900546 hartree
pointgroup: C01 [X(C19H24N4O1)]
dipole: -1.083589 0.2663228 -0.427843 debye
polarizability: 368.5928893|22.0628683|217.4459405|10.3084606|-19.4400018|162.9484949 unknown
InChI: InChI=1S/C19H24N4O/c20-19(24)17-8-4-5-9-18(17)21-10-11-22-12-14-23(15-13-22)16-6-2-1-3-7-16/h1-9,21H,10-15,20H2
charge 0 multiplicity 1
48 atoms
O  -5.056578 -2.147773 1.164245
N  0.831059 -0.694659 0.385133
N  3.648293 -0.060682 0.084103
N  -2.962429 -0.613645 0.791548
N  -7.1065 -1.557633 0.318257
C  1.755817 -1.636752 -0.29194
C  1.284013 0.695777 0.140133
C  3.183774 -1.458462 0.247641
C  2.713637 0.919423 0.667942
C  -0.588381 -0.919583 0.024581
C  -1.555198 -0.367995 1.107567
C  5.037704 0.224794 0.056309
C  5.574245 1.406973 0.653214
C  5.950827 -0.648335 -0.613032
C  -3.741012 0.162125 -0.042892
C  6.951845 1.70251 0.567117
C  7.324565 -0.347441 -0.682503
C  7.843718 0.832213 -0.097284
C  -5.14085 -0.164128 -0.25807
C  -3.206276 1.314932 -0.710859
C  -5.904674 0.652425 -1.139052
C  -4.000222 2.101493 -1.555265
C  -5.362213 1.774027 -1.78655
C  -5.744765 -1.332076 0.43962
H  1.76291 -1.482027 -1.400935
H  1.42101 -2.670781 -0.089501
H  0.608807 1.400961 0.657629
H  1.262508 0.936757 -0.954129
H  3.193023 -1.740654 1.325483
H  3.857683 -2.1453 -0.286489
H  3.028524 1.936678 0.377517
H  2.704347 0.861036 1.78145
H  -0.847327 -0.478469 -0.969843
H  -0.757231 -2.009301 -0.056561
H  -1.319464 -0.870077 2.062062
H  -1.382221 0.713789 1.268122
H  -3.460449 -1.434961 1.186329
H  4.926579 2.090949 1.209095
H  5.585354 -1.552362 -1.110317
H  7.329311 2.617696 1.038686
H  7.993905 -1.036576 -1.211015
H  8.912287 1.063066 -0.157146
H  -2.155355 1.581161 -0.565994
H  -6.952477 0.403326 -1.34609
H  -3.556862 2.973081 -2.050812
H  -5.975432 2.378666 -2.461414
H  -7.739558 -0.936667 -0.176824
H  -7.483371 -2.369317 0.804935
