program: Gaussian 09
title: 000215697
version: EM64L-G09RevD.01
frameworkgroup: C1[X(C10H12N2O3S)]
method: RPBEPBE
basis: SDD
operation: Freq
keyword: #p
keyword: freq=noraman
keyword: PBEPBE/SDD
title: #p freq=noraman PBEPBE/SDD
converged: NO YES NO NO
title: Mulliken charges:
elementType: S O O O N N C C C C C C C C C C H H H H H H H H H H H H
charge: 0.944160 -0.238578 -0.546058 -0.539810 -0.237232 -0.716624 -0.390253 -0.454640 -0.525825 0.180347 0.449710 -0.318751 -0.338110 -0.060293 -0.237930 -0.246430 0.238887 0.245275 0.237239 0.241682 0.250585 0.262443 0.316960 0.253199 0.281204 0.282107 0.334502 0.332233
chargesum: 0.00000
title: Mulliken charges with hydrogens summed into heavy atoms:
elementType: S O O O N N C C C C C C C C C C
charge: 0.944160 -0.238578 -0.546058 -0.539810 -0.237232 -0.049890 0.093909 0.024281 -0.012797 0.180347 0.449710 -0.001790 -0.084911 -0.060293 0.043274 0.035677
polarizability: 2.42280093e+02 -3.16799103e+00 1.51672154e+02 1.58717342e+00 -2.83439501e+00 9.43501967e+01
1716.lowfreq: -15.2040 -6.7517 -1.7612 -0.0018 0.0003 0.0021 21.2995 44.1586 57.2490
frequency: 20.7242 44.0147 57.2433 97.4650 108.6270 112.0939 145.7988 174.7944 184.9461 196.1130 239.9271 268.3679 303.4408 323.6521 356.7673 382.9960 394.2110 415.9471 453.6478 476.4520 527.6639 538.8633 560.2080 618.6526 630.7542 664.0630 715.0295 736.7372 795.3860 810.7613 827.2775 839.1790 864.1395 898.2309 908.0403 917.2851 950.5074 964.1338 987.1511 997.2570 1035.5902 1061.1636 1070.4851 1073.1618 1101.2377 1131.6982 1161.5663 1193.6903 1196.2018 1210.7641 1231.1142 1285.3921 1300.1359 1315.2012 1323.9467 1361.3857 1390.6618 1415.5846 1452.2807 1477.5383 1482.9439 1494.7650 1533.8121 1586.6479 1597.1481 1635.7196 2978.1436 3008.4251 3026.2627 3054.8407 3090.4294 3102.5252 3156.0366 3159.2320 3176.3993 3194.8977 3361.9784 3529.4537
redmass: 5.5031 4.6770 3.5493 6.7651 3.5504 1.5855 2.6616 2.8736 8.9268 5.9442 4.2428 2.4949 8.1120 7.9626 6.8924 5.9404 5.3068 2.9839 8.8837 3.7775 2.9350 4.5768 2.7968 6.4645 3.6771 5.4384 3.7121 3.4085 2.9752 2.6110 1.4163 1.7848 1.4514 1.5377 4.0323 4.3692 2.2230 1.4281 5.0824 1.3352 2.1876 2.3911 1.5419 1.7059 3.4413 1.4392 1.2993 1.2853 2.1086 1.7226 1.2056 1.3378 1.5846 1.8774 1.3620 2.2448 5.0489 3.3554 1.0831 1.1509 2.1759 1.1063 1.0852 7.7456 5.8065 11.0845 1.0637 1.0664 1.0652 1.0982 1.0982 1.1025 1.0887 1.0912 1.0957 1.0951 1.0414 1.0999
irintensity: 1.6310 1.2059 5.6958 2.3948 4.1046 32.2408 3.4173 1.6627 2.1641 6.3779 4.4334 3.4522 3.0988 10.0723 47.8032 1.4176 6.5803 0.4900 36.9064 134.0487 78.3766 17.9513 17.1914 3.1350 6.8954 10.4887 1.7191 0.6554 23.6340 262.7132 19.6721 6.6330 51.8131 3.7720 60.9842 1.5806 7.7224 0.3726 2.5024 2.4436 15.6239 56.7599 22.8362 7.5791 9.3457 9.1950 9.0111 2.9842 124.0521 34.8078 8.3989 3.8381 61.8507 176.0290 2.4731 155.2368 16.1007 15.4300 16.2517 68.7336 138.6694 1.4506 19.7013 1.0891 133.1755 220.6590 34.1583 12.7607 27.0146 22.6043 14.8239 26.6324 1.8317 2.7659 12.6455 9.7520 26.1831 23.3414
temp: 298.150 k
press: 1.00000 atm
elementType: 16 8 8 8 7 7 6 6 6 6 6 6 6 6 6 6 1 1 1 1 1 1 1 1 1 1 1 1
symmnumber: 1
zpe: 553075.5 jmol-1
zpe.correction: 0.210655 hartree
zpe.thermalcorrener: 0.226426 hartree
zpe.thermalcorrenthalpy: 0.227370 hartree
zpe.thermalcorrgfe: 0.166113 hartree
zpe.sumelectzpe: -1120.153224 hartree
zpe.sumelectthermal: -1120.137454 hartree
zpe.sumelectthermalent: -1120.136509 hartree
zpe.sumelectthermalfe: -1120.197766 hartree
dipole: -5.5816 -3.5283 2.8202
dipole: 7.1802
quadrupole: -92.6219 -105.2642 -104.4381
quadrupole: 15.6047 16.1072 -0.7310
quadrupole: 8.1528 -4.4895 -3.6633 15.6047 16.1072 -0.7310
hfenergy: -1120.3638794 hartree
pointgroup: C01 [X(C10H12N2O3S1)]
dipole: 2.2039888 -1.4119535 -1.0625474 debye
polarizability: 242.2356775|2.669268|151.6960806|3.6973594|2.2340637|94.3706858 unknown
InChI: InChI=1S/C10H12N2O3S/c11-16(14,15)9-5-3-8(4-6-9)12-7-1-2-10(12)13/h3-6H,1-2,7,11H2
charge 0 multiplicity 1
28 atoms
S  -3.827265 -0.016691 0.049817
O  2.845404 2.100126 -0.155853
O  -4.351761 -1.499387 0.478042
O  -4.279151 1.351238 0.809939
N  2.261296 -0.209787 -0.002881
N  -4.298715 0.183447 -1.723957
C  2.975362 -1.516243 -0.000223
C  4.449479 -1.142885 0.303213
C  4.578367 0.313248 -0.194674
C  3.158244 0.880744 -0.110647
C  0.84221 -0.140484 -0.003299
C  0.160476 1.107141 0.124123
C  0.084202 -1.342972 -0.118049
C  -1.953294 -0.061638 0.011156
C  -1.246174 1.14501 0.131589
C  -1.323055 -1.307784 -0.11152
H  2.868633 -2.009994 -0.986688
H  2.55196 -2.184242 0.769664
H  5.152849 -1.834715 -0.187095
H  4.629438 -1.18821 1.391259
H  4.90944 0.367691 -1.249507
H  5.266935 0.935807 0.397796
H  0.740199 2.027414 0.208099
H  0.581553 -2.310476 -0.222074
H  -1.779879 2.092615 0.254876
H  -1.915555 -2.22549 -0.178562
H  -4.911145 -0.611787 -1.972875
H  -4.765351 1.100402 -1.826969
