program: Gaussian 09
title: 000215706
version: EM64L-G09RevD.01
frameworkgroup: C1[X(C16H15FN2O3S)]
method: RPBEPBE
basis: SDD
operation: Freq
keyword: #p
keyword: freq=noraman
keyword: PBEPBE/SDD
title: #p freq=noraman PBEPBE/SDD
converged: YES YES NO NO
title: Mulliken charges:
elementType: S F O O O N N C C C C C C C C C C C C C C C C H H H H H H H H H H H H H H H
charge: 0.949441 -0.195901 -0.228145 -0.533246 -0.537465 -0.255474 -0.718633 -0.283983 -0.428638 -0.549004 0.175515 0.474482 0.309798 -0.437313 -0.373344 0.236291 -0.291391 -0.035727 -0.362257 -0.250016 -0.222088 -0.234905 -0.243604 0.239014 0.263366 0.259369 0.256207 0.272522 0.231827 0.239702 0.312624 0.311784 0.284469 0.229104 0.228999 0.232702 0.337602 0.336315
chargesum: 0.00000
title: Mulliken charges with hydrogens summed into heavy atoms:
elementType: S F O O O N N C C C C C C C C C C C C C C C C
charge: 0.949441 -0.195901 -0.228145 -0.533246 -0.537465 -0.255474 -0.044716 -0.044969 0.094097 -0.020274 0.175515 0.474482 0.309798 -0.205486 -0.133641 0.236291 0.021232 -0.035727 -0.050473 0.034452 0.007016 -0.005906 -0.010902
polarizability: 3.12988352e+02 -2.05003136e+01 1.83653620e+02 4.35999623e+00 -8.43043786e+00 1.78942413e+02
1716.lowfreq: -7.7065 -2.3223 -0.0016 -0.0011 0.0006 5.2425 15.8007 20.8232 21.9102
frequency: 15.7656 20.7868 21.8208 36.7526 59.0289 69.4194 94.7686 106.8742 127.0657 150.2630 172.7337 177.4309 206.0306 224.8855 239.0365 260.3085 272.7330 286.3739 303.9385 311.0551 332.0897 379.3872 391.6687 402.7110 439.9856 453.3294 462.1732 474.7811 520.1391 531.3463 544.4437 570.3464 575.6055 598.2205 615.2559 649.0913 683.5016 707.1338 728.1374 739.4824 768.1498 777.9794 792.5184 796.1992 834.8504 837.8298 853.2774 884.8264 907.0730 909.9590 921.4064 926.7418 955.6881 968.4409 977.1483 989.9731 997.5777 1008.0844 1031.4662 1048.7619 1061.6716 1074.1760 1085.0980 1096.0047 1112.0248 1147.2141 1174.1317 1175.2857 1185.3364 1192.4012 1194.8674 1219.8963 1237.5095 1253.9713 1294.9278 1306.8615 1315.5887 1352.3540 1353.9734 1386.0376 1386.8215 1408.9283 1441.2095 1445.9238 1483.4986 1484.4083 1487.5143 1534.4720 1581.9474 1593.2035 1600.7500 1614.1005 1638.8504 3005.4923 3021.3818 3043.9258 3091.1036 3097.3066 3115.9853 3122.8301 3135.9988 3147.0187 3165.2516 3166.3925 3170.8109 3200.3208 3365.9298 3533.6436
redmass: 6.7580 5.5458 4.6455 5.3653 6.1333 7.4202 7.9719 1.5643 4.5168 3.2784 7.8478 7.2846 5.5287 7.1502 3.5706 3.8371 4.7026 3.7399 4.1952 8.4798 5.8734 5.5984 5.1906 2.8146 7.0392 5.2945 4.1080 3.8251 3.6111 4.5827 4.0457 4.5284 4.1581 4.2751 6.3844 6.7837 5.9060 1.6678 3.6646 4.3116 2.8712 2.6339 1.7573 11.6407 2.0703 2.4599 1.2472 1.4686 2.3230 3.9292 1.6164 2.8567 2.6949 1.3705 1.3893 5.7057 1.3243 2.1980 2.0078 2.4004 1.8735 1.5632 1.9473 3.0553 3.0321 1.3793 1.0724 1.5507 1.5521 1.1243 2.2198 1.5946 1.3561 1.5716 1.4458 1.8549 2.0257 1.6269 2.0895 4.4188 4.8291 4.2276 1.3180 1.5653 2.2118 1.8980 1.4508 1.0850 8.6803 5.9458 7.1966 6.0973 11.5503 1.0667 1.0619 1.0839 1.1060 1.0972 1.0876 1.0864 1.0908 1.0958 1.1015 1.0912 1.0930 1.0947 1.0414 1.1002
irintensity: 0.5493 0.1443 0.1035 1.8400 1.4434 3.7183 2.6703 32.8861 3.3547 5.4484 4.6404 1.7066 0.0607 2.0555 8.3942 2.0620 3.1798 1.2808 3.1936 0.1349 20.5886 20.8802 14.9228 0.0713 30.9279 30.7195 11.9674 161.4670 6.3815 2.6456 23.7925 7.4358 2.4616 20.5484 0.7834 10.6734 9.2001 51.0704 0.8592 2.2126 49.7092 5.6291 147.8079 70.3482 88.9881 33.5045 0.2688 25.4890 1.2498 51.7139 0.3999 3.9015 6.9133 1.5717 0.1690 0.0772 0.1606 12.7517 4.8709 4.9846 56.5168 29.9499 2.2769 47.3536 6.4542 10.5741 3.7913 33.2135 60.1024 2.2814 73.1520 5.8207 5.1871 43.5910 4.8082 59.4407 145.9425 26.2558 125.2811 26.7280 6.7856 25.2704 22.0748 3.5755 85.8591 234.2202 17.8946 22.4167 13.8175 0.4223 71.3318 8.1175 210.3709 12.9070 10.2548 32.6306 14.9986 7.2361 9.1067 5.1203 8.9884 38.4294 21.6033 2.0189 15.2831 4.5052 29.4796 25.8636
temp: 298.150 k
press: 1.00000 atm
elementType: 16 9 8 8 8 7 7 6 6 6 6 6 6 6 6 6 6 6 6 6 6 6 6 1 1 1 1 1 1 1 1 1 1 1 1 1 1 1
symmnumber: 1
zpe: 738384.2 jmol-1
zpe.correction: 0.281236 hartree
zpe.thermalcorrener: 0.302702 hartree
zpe.thermalcorrenthalpy: 0.303647 hartree
zpe.thermalcorrgfe: 0.227673 hartree
zpe.sumelectzpe: -1449.959866 hartree
zpe.sumelectthermal: -1449.938400 hartree
zpe.sumelectthermalent: -1449.937456 hartree
zpe.sumelectthermalfe: -1450.013429 hartree
dipole: 5.8013 3.0227 2.0194
dipole: 6.8461
quadrupole: -147.7153 -131.7224 -151.3048
quadrupole: -18.5297 4.4177 -8.5886
quadrupole: -4.1345 11.8584 -7.7240 -18.5297 4.4177 -8.5886
hfenergy: -1450.2411022 hartree
pointgroup: C01 [X(C16H15F1N2O3S1)]
dipole: 2.3648775 1.1899929 -0.4960836 debye
polarizability: 306.0775866|-4.9189673|173.6126752|35.0654466|3.501155|195.8941229 unknown
InChI: InChI=1S/C16H15FN2O3S/c17-14-9-13(23(18,21)22)6-7-15(14)19-10-12(8-16(19)20)11-4-2-1-3-5-11/h1-7,9,12H,8,10,18H2
charge 0 multiplicity 1
38 atoms
S  -5.132618 0.114916 -1.17162
F  -1.187004 1.706732 1.827247
O  0.702879 -2.924795 1.088621
O  -5.711655 -1.364716 -1.526113
O  -5.917933 1.201659 -0.246074
N  0.471951 -0.551846 1.174048
N  -4.8073 0.951331 -2.780136
C  2.760217 0.054463 1.660061
C  1.308201 0.613898 1.598864
C  2.533403 -1.462782 1.933739
C  1.156803 -1.780818 1.350523
C  3.583236 0.302525 0.395313
C  -0.839129 -0.41994 0.652656
C  4.954305 0.646275 0.51136
C  3.02695 0.167754 -0.904229
C  -1.652411 0.715325 0.935805
C  -1.41045 -1.424383 -0.184787
C  -3.416662 -0.105121 -0.44704
C  -2.927375 0.905237 0.39178
C  -2.696785 -1.273745 -0.736445
C  5.75326 0.847675 -0.636774
C  3.822279 0.370181 -2.053743
C  5.189112 0.709367 -1.925339
H  3.289075 0.517476 2.510859
H  0.978608 0.977638 2.58689
H  1.207131 1.438403 0.875022
H  2.509518 -1.683127 3.018372
H  3.295684 -2.113389 1.477721
H  5.39928 0.760626 1.508077
H  1.969309 -0.0956 -1.025409
H  -0.835677 -2.331282 -0.376625
H  -3.525541 1.783787 0.651286
H  -3.135306 -2.056215 -1.362539
H  6.809831 1.11621 -0.526067
H  3.376266 0.262645 -3.04887
H  5.805052 0.866782 -2.817508
H  -5.294492 1.863017 -2.768198
H  -5.13001 0.325738 -3.537128
