program: Gaussian 09
title: 000215717
version: EM64L-G09RevD.01
frameworkgroup: C1[X(C23H30N2O4)]
method: RPBEPBE
basis: SDD
operation: Freq
keyword: #p
keyword: freq=noraman
keyword: PBEPBE/SDD
title: #p freq=noraman PBEPBE/SDD
converged: YES YES NO NO
title: Mulliken charges:
elementType: O O O O N N C C C C C C C C C C C C C C C C C C C C C C C H H H H H H H H H H H H H H H H H H H H H H H H H H H H H H
charge: -0.443241 -0.304980 -0.279063 -0.231669 -0.103866 -0.181334 -0.382491 -0.358675 -0.394833 -0.383016 -0.376666 -0.137242 0.505825 -0.320686 -0.518321 -0.411013 0.343905 -0.214830 -0.403646 0.392866 -0.408468 -0.346770 0.291803 -0.324032 -0.356314 -0.536005 0.127272 -0.484244 -0.685112 0.192564 0.216626 0.204262 0.196722 0.221840 0.206832 0.210653 0.209209 0.224138 0.216554 0.224338 0.236823 0.241592 0.258088 0.218133 0.351246 0.216024 0.240302 0.249160 0.256514 0.246572 0.277920 0.219305 0.219769 0.241346 0.229405 0.229408 0.230485 0.231094 0.207922
chargesum: 0.00000
title: Mulliken charges with hydrogens summed into heavy atoms:
elementType: O O O O N N C C C C C C C C C C C C C C C C C C C C C C C
charge: -0.091995 -0.304980 -0.279063 -0.231669 -0.103866 -0.181334 0.026698 0.042309 0.033840 0.036847 0.064026 0.087096 0.505825 0.157729 -0.260233 -0.192880 0.343905 0.001194 -0.163344 0.392866 -0.159308 -0.090256 0.291803 -0.077461 -0.078394 0.144415 0.127272 -0.025431 -0.015611
polarizability: 3.57338285e+02 2.12989487e+01 3.15093504e+02 -2.66980871e+01 6.74312385e-01 2.05639912e+02
1716.lowfreq: -4.5243 -1.0083 -0.0012 -0.0008 0.0006 6.8231 8.7776 15.8369 20.0485
frequency: 6.9903 15.6361 20.0018 25.7473 39.1030 54.6632 58.2623 70.3161 81.5517 85.5869 86.1469 103.6118 121.0155 138.3208 149.4758 169.7398 181.8998 193.1389 204.1652 225.5007 236.7562 242.8493 261.4936 269.0664 281.6397 286.7769 304.0074 321.4453 332.6165 357.9771 378.4717 400.3257 405.0170 413.3537 427.2852 446.7137 453.5000 470.3914 486.0359 493.8552 495.2556 524.9552 550.6626 560.9448 565.3833 606.1681 628.4548 635.7139 643.6075 684.0321 693.6345 722.0733 727.0724 755.4693 777.2877 801.3110 808.3349 813.9026 825.8470 833.4942 841.5851 844.4329 848.7760 854.4768 912.7700 941.0692 942.1908 944.5577 950.2408 951.6302 962.1819 977.1618 988.6509 997.9723 1002.4302 1006.3026 1019.1919 1024.5932 1050.5371 1060.5270 1068.6032 1071.1783 1091.1973 1092.6617 1095.6502 1106.5406 1111.9115 1119.8897 1141.4579 1144.8400 1153.0711 1172.6895 1173.8451 1177.5643 1191.2265 1207.5727 1222.6874 1227.1672 1233.3325 1239.4228 1247.7599 1250.1728 1256.6403 1291.4711 1300.8014 1301.9268 1303.7667 1325.7893 1335.2457 1342.9043 1347.6005 1351.1676 1354.4917 1369.2139 1374.3034 1377.7692 1381.4126 1392.5911 1396.6380 1397.2381 1427.0740 1433.2915 1438.5779 1450.8645 1453.5287 1454.5413 1458.1679 1462.8312 1465.6611 1468.6231 1469.0732 1476.6123 1476.9649 1477.3696 1491.0118 1499.3666 1563.4624 1577.6456 1590.3388 1621.1497 1623.6965 2866.9080 2873.8620 2905.8237 2915.1836 2925.0752 2957.4577 2967.3439 2987.4073 2997.6997 3013.7865 3035.0949 3035.8961 3040.5015 3043.7541 3053.5120 3057.3975 3063.3293 3090.5372 3093.2632 3102.2937 3120.6799 3127.8856 3144.6445 3148.3401 3159.2388 3166.6040 3170.6302 3172.4054 3177.0778 3536.9167
redmass: 5.8178 4.0937 4.2923 5.4076 4.4893 3.2145 3.8539 5.2322 2.2381 3.1395 4.3212 3.9575 4.2403 5.1643 4.4495 3.4266 3.3015 1.2746 1.9057 3.7798 2.6368 3.2294 1.7208 2.4638 3.8098 4.8336 2.7810 4.8055 2.9915 3.6496 2.2907 3.4475 3.0792 2.9650 1.2896 2.5403 3.0487 3.0482 2.9685 4.6672 3.7223 4.7012 4.6453 4.7353 2.1026 3.3114 7.1398 3.1743 3.7122 1.7930 4.0493 3.8214 3.2191 1.6117 3.5514 1.4826 4.4882 4.3897 1.2651 1.5252 2.7052 1.6453 1.6833 1.6640 2.4375 2.9818 3.7597 2.8046 1.8226 2.3943 1.3467 5.6205 1.3545 2.0482 2.5428 2.5807 1.5731 3.4500 1.7946 1.9324 1.6549 2.1587 2.7075 1.8849 1.9940 1.9992 1.2595 1.3378 2.6281 2.2820 1.4031 2.1010 1.2774 1.4712 1.2900 1.2137 1.6244 1.7502 2.4536 2.0338 1.1850 1.3998 1.5641 1.4594 1.4106 1.3140 1.3466 1.4078 1.9719 1.3240 1.3623 1.3953 1.8261 1.4588 3.1732 1.5631 1.4996 1.4090 4.3407 1.2119 4.2000 1.3460 1.1107 2.2295 1.1113 1.0889 1.1218 1.0952 1.0512 1.1097 1.0389 1.0867 1.0950 1.0566 2.5688 2.4761 7.4495 5.8957 7.3515 6.7562 6.6031 1.0711 1.0697 1.0693 1.0710 1.0680 1.0329 1.0599 1.0551 1.0365 1.0981 1.0895 1.0886 1.0905 1.1037 1.0902 1.0902 1.1088 1.0888 1.1001 1.0998 1.0992 1.0868 1.0876 1.0883 1.0918 1.0960 1.0964 1.0952 1.0913 1.0653
irintensity: 0.0200 0.7541 0.3410 0.6016 0.3933 0.9283 1.7597 1.2052 1.8458 4.1433 5.7275 1.1941 0.6794 0.6075 4.3207 6.4709 3.8608 0.2176 0.5548 1.8731 1.6164 11.1995 1.1008 1.1323 9.7346 0.8281 7.1093 2.7385 6.8704 1.4752 0.1970 4.4084 5.5692 0.1739 165.6261 62.7244 2.4578 0.4616 5.7163 0.6732 2.1116 8.6041 2.2947 13.3316 10.4841 1.1348 6.0420 8.5285 9.4646 27.7898 7.0510 3.4703 0.6042 48.1827 1.9721 57.6075 1.9668 16.1962 0.9148 1.3143 11.8465 6.5212 48.9881 33.6293 46.0293 65.2206 26.4620 64.1959 6.0551 3.2870 0.4644 12.8546 0.4612 22.8186 2.4548 165.8946 13.4512 55.9225 10.9671 2.5415 1.4086 38.5228 1.4081 24.2368 7.8088 11.7339 0.2241 17.7470 64.3634 73.6127 12.3797 20.7863 238.0240 169.7094 76.9714 20.1848 110.1241 179.5940 128.3007 106.6773 0.3998 20.5029 40.4955 18.7841 18.7681 1.4472 10.2748 9.2112 95.1017 9.6716 4.6398 1.0979 18.5132 16.7606 56.8351 45.4483 32.4589 13.1773 15.4468 27.8291 1.6506 10.5209 24.6264 16.3130 42.1244 24.5598 4.7406 48.8549 11.9334 32.9589 11.7192 26.6925 13.0383 19.6385 134.7599 31.0370 73.6066 97.7857 212.7577 177.1896 295.7043 50.0604 86.8036 52.0417 108.2194 105.4115 77.3147 35.4456 18.7865 34.6484 11.0664 14.2552 23.1981 44.5133 51.3197 59.9250 23.1235 21.9997 22.6894 28.5873 31.2123 27.3923 12.8545 9.5516 0.6921 23.9505 12.4700 9.0079 15.9380 0.8376 16.7597
temp: 298.150 k
press: 1.00000 atm
elementType: 8 8 8 8 7 7 6 6 6 6 6 6 6 6 6 6 6 6 6 6 6 6 6 6 6 6 6 6 6 1 1 1 1 1 1 1 1 1 1 1 1 1 1 1 1 1 1 1 1 1 1 1 1 1 1 1 1 1 1
symmnumber: 1
zpe: 1286865.7 jmol-1
zpe.correction: 0.490141 hartree
zpe.thermalcorrener: 0.519057 hartree
zpe.thermalcorrenthalpy: 0.520001 hartree
zpe.thermalcorrgfe: 0.426065 hartree
zpe.sumelectzpe: -1302.614870 hartree
zpe.sumelectthermal: -1302.585955 hartree
zpe.sumelectthermalent: -1302.585011 hartree
zpe.sumelectthermalfe: -1302.678947 hartree
dipole: -2.0712 -0.8680 -1.8347
dipole: 2.8999
quadrupole: -165.4430 -183.6547 -170.7784
quadrupole: -13.3848 -23.8092 -7.9078
quadrupole: 7.8491 -10.3627 2.5136 -13.3848 -23.8092 -7.9078
hfenergy: -1303.1050116 hartree
pointgroup: C01 [X(C23H30N2O4)]
dipole: -0.7858123 -0.5535514 -0.6146367 debye
polarizability: 340.9260887|24.5922665|323.9797266|-40.2737169|-15.9601902|213.1658853 unknown
InChI: InChI=1S/C23H30N2O4/c1-3-23(27)18-7-9-21(10-8-18)29-17-20(26)16-24-11-13-25(14-12-24)19-5-4-6-22(15-19)28-2/h4-10,15,20,26H,3,11-14,16-17H2,1-2H3
charge 0 multiplicity 1
59 atoms
O  2.575297 -4.182827 0.033475
O  2.909115 -1.440034 -0.346783
O  -6.526093 2.337858 -0.030792
O  5.8047 4.253355 0.636115
N  -0.715388 -2.312425 -0.132198
N  -3.436071 -1.386923 0.23681
C  -1.390728 -1.496335 -1.169678
C  -1.715697 -3.15503 0.567224
C  -2.46662 -0.591359 -0.540935
C  -2.785581 -2.272823 1.230438
C  0.449618 -3.080561 -0.63199
C  1.538004 -3.234187 0.460709
C  -4.712312 -0.836535 0.526847
C  2.156538 -1.887335 0.85084
C  -5.048359 0.492131 0.151458
C  -5.716712 -1.624758 1.175914
C  -6.341991 1.009268 0.397225
C  -6.99079 -1.086964 1.42119
C  -7.334985 0.232024 1.037959
C  3.596939 -0.225076 -0.293788
C  4.30925 0.127304 -1.468803
C  3.60903 0.635359 0.835446
C  5.056363 2.210329 -0.392861
C  5.029105 1.33198 -1.513928
C  4.335631 1.837793 0.773192
C  -7.830074 2.951508 0.222475
C  5.810967 3.506608 -0.388648
C  6.588487 3.909356 -1.648753
C  7.321846 5.253391 -1.503781
H  -1.875248 -2.13995 -1.946125
H  -0.638379 -0.859788 -1.670183
H  -1.210415 -3.754868 1.346257
H  -2.21193 -3.862705 -0.143515
H  -2.999924 -0.073724 -1.356749
H  -1.971246 0.180001 0.094512
H  -2.302659 -1.664608 2.030001
H  -3.537803 -2.918467 1.70843
H  0.173621 -4.100686 -0.984424
H  0.89188 -2.542504 -1.491036
H  1.097303 -3.689186 1.365658
H  2.859031 -2.005543 1.697477
H  1.355859 -1.163619 1.093814
H  -4.323943 1.167474 -0.309593
H  -5.516203 -2.663102 1.454701
H  3.153463 -3.709749 -0.620661
H  -7.746149 -1.713378 1.909963
H  -8.337408 0.619976 1.235846
H  4.282348 -0.553736 -2.324939
H  3.063106 0.377301 1.747112
H  5.571898 1.585676 -2.430046
H  4.363328 2.519965 1.629677
H  -8.640383 2.41208 -0.306164
H  -8.056826 2.986426 1.306205
H  -7.748306 3.975234 -0.172133
H  5.878977 3.945471 -2.501202
H  7.307191 3.099915 -1.892406
H  8.046562 5.218591 -0.672626
H  6.611511 6.066609 -1.277504
H  7.862258 5.503605 -2.434327
