program: Gaussian 09
title: 000215667
version: EM64L-G09RevD.01
frameworkgroup: C1[X(C19H24N2O)]
method: RPBEPBE
basis: SDD
operation: Freq
keyword: #p
keyword: freq=noraman
keyword: PBEPBE/SDD
title: #p freq=noraman PBEPBE/SDD
converged: YES YES NO NO
title: Mulliken charges:
elementType: O N N C C C C C C C C C C C C C C C C C C C H H H H H H H H H H H H H H H H H H H H H H H H
charge: -0.245031 -0.027681 -0.356092 -0.567221 -0.396051 -0.386637 0.227271 -0.394673 -0.503080 -0.040554 0.102549 0.245458 -0.092018 0.064419 -0.360073 -0.330006 -0.397294 -0.329559 -0.259567 -0.234322 -0.350883 -0.684925 0.249178 0.206098 0.198784 0.207263 0.204090 0.189750 0.207913 0.211280 0.200554 0.239540 0.251133 0.318342 0.211114 0.258122 0.263892 0.213836 0.197488 0.227013 0.231578 0.194259 0.192841 0.213216 0.217846 0.210841
chargesum: 0.00000
title: Mulliken charges with hydrogens summed into heavy atoms:
elementType: O N N C C C C C C C C C C C C C C C C C C C
charge: -0.245031 -0.027681 -0.037750 -0.111946 0.009996 0.007202 0.227271 0.024520 -0.062986 -0.040554 0.102549 0.245458 -0.092018 0.064419 -0.108940 -0.066114 0.071943 0.081765 -0.032554 -0.002744 0.036218 -0.043023
polarizability: 2.46346796e+02 -1.96749969e+01 2.76078756e+02 -2.21052799e+01 1.11334434e+01 1.55874707e+02
1716.lowfreq: -6.4812 -3.7069 -0.0006 -0.0006 0.0005 4.4560 11.0584 19.4055 32.1997
frequency: 6.5561 18.7783 32.1397 56.0941 71.0579 75.1174 88.6245 97.7505 149.6376 158.9596 168.5455 196.3826 218.5285 234.1374 247.1118 261.9071 286.1413 318.6856 325.8929 341.6948 354.6633 371.8712 405.4364 438.5773 454.0977 473.1428 495.2480 522.8832 528.3304 560.7811 583.5864 624.0685 634.4250 657.1907 691.6238 715.9402 731.4681 738.4245 767.5516 775.5830 801.8367 806.7503 829.8240 843.4867 848.0052 856.0070 869.4083 882.6852 898.9955 934.6008 951.5086 957.5128 965.6380 973.6345 987.1713 994.7560 1021.7080 1041.2310 1045.7025 1069.7013 1083.5781 1100.2889 1116.5642 1120.1735 1129.4513 1135.1274 1144.3545 1169.6449 1200.9150 1210.2613 1220.9551 1228.7746 1239.6056 1252.1642 1261.3459 1270.5124 1282.3595 1292.0195 1311.1066 1314.7043 1320.9183 1327.4505 1340.3713 1346.1074 1351.1359 1356.2263 1364.1064 1372.5818 1387.1475 1390.8229 1418.4315 1444.5296 1452.1106 1457.6525 1458.3224 1459.8889 1464.9107 1469.5554 1473.6090 1478.4002 1480.1208 1484.6556 1486.6930 1497.0802 1549.6518 1569.6993 1593.9058 1618.3089 2957.9559 2959.4387 2968.8408 2970.3796 2974.9992 2976.7864 2978.0427 2978.7741 2988.7064 3004.3640 3016.8693 3027.4246 3038.5939 3043.3550 3064.3824 3069.6840 3071.8474 3074.8004 3075.5345 3127.9499 3139.8149 3155.4177 3169.6698 3546.1283
redmass: 3.7029 5.5437 3.9632 3.3201 2.7510 2.4013 2.8526 3.7520 3.3799 2.9496 3.9409 4.8539 3.6198 1.4388 2.0277 2.3058 2.6471 3.3068 3.4694 3.7368 2.9027 3.0381 3.4765 4.2598 3.4751 2.1944 2.4725 2.6779 3.0093 3.7761 1.2396 5.7528 4.4605 4.5742 4.9638 3.8783 3.3211 1.3022 2.6142 1.3965 2.4622 2.9751 1.5046 1.8148 2.5901 2.6761 2.7257 1.7599 2.2957 2.2848 1.8726 2.3296 1.3679 1.6984 2.5849 1.3210 2.1775 2.4390 2.7802 1.9011 2.5826 2.3264 2.0466 2.0442 1.5212 1.7777 1.6093 1.2253 1.3924 1.4353 1.7087 1.3513 2.5207 1.3339 1.3216 1.2702 1.6711 1.1066 1.3699 1.9975 1.5199 1.5298 1.5234 1.5650 1.5043 1.4542 1.4571 3.5787 2.6561 1.2127 5.4719 2.1520 1.1528 1.2427 1.1265 1.0838 1.0953 1.0990 1.1006 1.0628 1.5925 1.1882 1.0976 2.7750 7.9044 8.4203 6.7463 6.3234 1.0611 1.0588 1.0632 1.0663 1.0371 1.0618 1.0591 1.0663 1.0661 1.0986 1.0962 1.1023 1.1026 1.1013 1.0935 1.0946 1.1004 1.0996 1.0994 1.0852 1.0897 1.0955 1.0997 1.0778
irintensity: 0.1518 4.4771 1.0823 0.8651 1.0322 0.2586 0.9242 2.3967 1.7677 0.4104 2.4442 1.1403 4.2166 1.5223 3.5499 0.2666 3.2528 2.7366 1.2550 2.0432 1.6395 2.8950 6.2610 2.1865 5.8576 2.0896 8.9168 1.9082 2.3371 0.6442 91.5762 6.6979 1.5651 1.9311 1.6436 2.1142 1.3494 16.5452 2.3723 75.7519 2.8149 2.6253 9.8895 4.6245 2.8663 2.7231 4.9534 1.6232 2.6428 4.7872 2.5204 27.8615 2.6444 11.4704 1.8101 0.3940 6.4123 0.7556 3.3142 2.7723 1.2475 1.8537 0.9171 2.8691 4.0359 3.3611 1.0594 4.7252 24.1785 15.9717 30.2672 21.4939 6.7163 6.9571 33.0956 14.6924 11.3097 0.5021 9.2684 13.0551 10.3740 0.8095 6.0866 9.6843 3.8825 0.3393 2.9425 21.5740 1.1580 11.7149 13.8481 9.3495 52.2394 8.8948 2.4559 4.1898 6.2079 8.3193 25.6041 1.5233 145.8262 36.1802 18.5266 57.1986 14.8731 6.6440 147.8765 2.4870 34.3915 26.7850 32.3413 20.3285 24.6303 37.0003 56.5625 17.9773 35.5329 3.8154 76.4982 27.5379 95.4444 53.4229 23.2772 13.1144 71.6726 7.7753 49.1539 0.2754 10.4200 23.0028 27.3203 16.2850
temp: 298.150 k
press: 1.00000 atm
elementType: 8 7 7 6 6 6 6 6 6 6 6 6 6 6 6 6 6 6 6 6 6 6 1 1 1 1 1 1 1 1 1 1 1 1 1 1 1 1 1 1 1 1 1 1 1 1
symmnumber: 1
zpe: 1024822.0 jmol-1
zpe.correction: 0.390334 hartree
zpe.thermalcorrener: 0.411131 hartree
zpe.thermalcorrenthalpy: 0.412076 hartree
zpe.thermalcorrgfe: 0.337797 hartree
zpe.sumelectzpe: -921.555188 hartree
zpe.sumelectthermal: -921.534391 hartree
zpe.sumelectthermalent: -921.533447 hartree
zpe.sumelectthermalfe: -921.607725 hartree
dipole: -2.8491 -0.0363 -3.2045
dipole: 4.2880
quadrupole: -127.7651 -116.8173 -142.4387
quadrupole: -0.3536 2.4732 6.9867
quadrupole: 1.2419 12.1898 -13.4317 -0.3536 2.4732 6.9867
hfenergy: -921.9455224 hartree
pointgroup: C01 [X(C19H24N2O1)]
dipole: 1.0972492 0.1637305 -1.2709616 debye
polarizability: 256.41687|-21.9608287|263.7638614|26.9063315|-15.2860148|158.1195276 unknown
InChI: InChI=1S/C19H24N2O/c1-2-3-13-20-19(22)18-14-9-5-4-6-11-16(14)21-17-12-8-7-10-15(17)18/h7-8,10,12,20H,2-6,9,11,13H2,1H3
charge 0 multiplicity 1
46 atoms
O  0.970964 1.44653 2.25627
N  -2.520204 -1.416206 -0.254337
N  1.467882 1.770014 0.000606
C  0.950679 -1.73856 1.338431
C  1.754754 -2.624564 0.339671
C  1.179854 -4.045679 0.132542
C  -0.289687 -1.093188 0.742244
C  -0.248109 -4.105483 -0.45845
C  -1.341435 -3.432619 0.421647
C  -1.396691 -1.919552 0.299329
C  -0.393646 0.298433 0.571465
C  -1.586901 0.87132 -0.001928
C  -2.634209 -0.041138 -0.406116
C  0.72704 1.214308 1.031387
C  -1.795587 2.280097 -0.170935
C  -3.840059 0.476203 -0.976078
C  2.622748 2.656157 0.236655
C  3.98465 1.948954 0.039666
C  -2.985272 2.759795 -0.725509
C  -4.013448 1.853243 -1.136048
C  4.238275 1.456607 -1.403554
C  5.621965 0.791211 -1.567704
H  1.61069 -0.952658 1.742273
H  0.659701 -2.364907 2.206402
H  1.832727 -2.101485 -0.635097
H  2.788245 -2.723885 0.726851
H  1.864918 -4.616888 -0.525945
H  1.178646 -4.569675 1.111686
H  -0.523714 -5.170023 -0.591717
H  -0.26268 -3.649046 -1.468049
H  -1.174446 -3.724869 1.479372
H  -2.336935 -3.805773 0.127404
H  -1.020484 2.982207 0.155128
H  1.218961 1.521608 -0.958892
H  2.546533 3.529127 -0.441076
H  2.531599 3.014812 1.276646
H  -4.609326 -0.244601 -1.269623
H  4.04975 1.096758 0.744291
H  4.784366 2.661797 0.326947
H  -3.138095 3.838492 -0.841737
H  -4.940138 2.245364 -1.569283
H  4.153246 2.313357 -2.103794
H  3.451046 0.730086 -1.692368
H  5.720291 -0.085009 -0.899741
H  5.785268 0.446393 -2.604993
H  6.433868 1.498433 -1.314041
