program: Gaussian 09
title: 000215645
version: EM64L-G09RevD.01
frameworkgroup: C1[X(C11H12N2O)]
method: RPBEPBE
basis: SDD
operation: Freq
keyword: #p
keyword: freq=noraman
keyword: PBEPBE/SDD
title: #p freq=noraman PBEPBE/SDD
converged: YES YES NO NO
title: Mulliken charges:
elementType: O N N C C C C C C C C C C C H H H H H H H H H H H H
charge: -0.242889 -0.018892 -0.413989 -0.332085 -0.516756 0.472451 0.154100 0.199024 -0.783002 -0.428239 -0.372359 -0.224864 -0.224735 -0.242560 0.224458 0.265497 0.251014 0.252963 0.228840 0.242988 0.231094 0.251085 0.338812 0.228046 0.228553 0.231443
chargesum: 0.00000
title: Mulliken charges with hydrogens summed into heavy atoms:
elementType: O N N C C C C C C C C C C C
charge: -0.242889 -0.018892 -0.075176 -0.107627 -0.000244 0.472451 0.154100 0.199024 -0.058210 -0.197145 -0.121274 0.003182 0.003818 -0.011116
polarizability: 1.49071235e+02 -1.53093123e+00 1.17923474e+02 -5.84950245e+00 6.30493492e+00 1.18618783e+02
1716.lowfreq: -19.0981 -10.1284 -4.6119 0.0000 0.0003 0.0005 22.4673 54.0564 95.9251
frequency: 21.8132 54.0395 95.9108 109.9334 164.0858 172.0056 244.3330 272.1055 317.4582 362.1311 401.9596 434.6996 444.4671 462.5642 489.3205 544.6886 605.9882 617.7412 638.4198 691.9776 703.7415 738.1247 751.5612 775.6045 791.6724 851.2038 904.5479 921.0064 945.9500 975.5493 978.8694 990.6513 996.8369 1026.3020 1028.6451 1046.4485 1084.8357 1116.9921 1160.8931 1173.6845 1184.1126 1192.7590 1217.6143 1245.9988 1291.5318 1300.5924 1339.1504 1349.2593 1382.4193 1390.9578 1403.2738 1438.6393 1442.1896 1455.8223 1458.8773 1481.6974 1592.0424 1607.9562 1612.4547 1632.8981 2972.2005 2984.7895 3006.7707 3045.7242 3091.8007 3113.3415 3113.6346 3126.8380 3138.0801 3148.6399 3165.0780 3553.5086
redmass: 3.9393 5.5187 5.1061 3.8396 3.5687 1.0642 3.5988 2.9262 3.5410 5.3609 2.7969 4.0767 4.6886 5.5192 3.7545 3.3118 4.1475 5.5891 4.7620 1.3053 1.7826 3.3383 4.4297 2.2245 3.7060 1.2490 2.6369 1.5954 2.2335 1.3925 2.6334 5.8322 1.3337 1.5301 2.1949 1.8879 1.6391 3.7739 1.6132 1.0552 1.8730 1.1209 1.3783 2.5613 1.8180 2.7795 1.3292 1.8845 6.7744 1.2658 1.4291 1.1985 1.8230 1.0782 1.0507 2.2219 6.1028 5.9675 6.3574 6.0898 1.0385 1.0684 1.0827 1.0966 1.0946 1.0911 1.0946 1.0859 1.0912 1.0958 1.1015 1.0784
irintensity: 0.3190 1.7774 0.3192 0.4564 1.7702 0.3300 1.7866 0.2801 1.4909 3.6327 0.0481 7.6440 12.1891 1.5864 12.7094 3.8544 10.8174 4.0015 6.2098 134.7171 38.6609 24.5706 9.4011 24.8569 0.3048 0.2173 15.3686 2.1670 4.8781 0.2298 29.4895 2.4780 0.1101 1.0571 3.8165 9.6895 7.4912 28.4617 25.7495 0.2774 18.1914 1.4693 5.0253 30.5658 6.2000 110.5214 8.6418 3.4999 0.2358 27.7434 3.8500 19.0835 3.0438 10.1328 16.1271 19.0448 2.8900 15.0756 17.7921 305.2531 18.3175 16.3842 24.6536 17.8793 5.1199 9.4112 11.9072 0.2105 12.6267 32.0288 21.1570 39.2336
temp: 298.150 k
press: 1.00000 atm
elementType: 8 7 7 6 6 6 6 6 6 6 6 6 6 6 1 1 1 1 1 1 1 1 1 1 1 1
symmnumber: 1
zpe: 547826.4 jmol-1
zpe.correction: 0.208656 hartree
zpe.thermalcorrener: 0.220881 hartree
zpe.thermalcorrenthalpy: 0.221825 hartree
zpe.thermalcorrgfe: 0.169051 hartree
zpe.sumelectzpe: -610.073898 hartree
zpe.sumelectthermal: -610.061673 hartree
zpe.sumelectthermalent: -610.060729 hartree
zpe.sumelectthermalfe: -610.113503 hartree
dipole: -2.0847 3.1338 1.1983
dipole: 3.9500
quadrupole: -80.5400 -93.8418 -73.3778
quadrupole: 7.2192 0.3361 3.8719
quadrupole: 2.0465 -11.2553 9.2087 7.2192 0.3361 3.8719
hfenergy: -610.2825538 hartree
pointgroup: C01 [X(C11H12N2O1)]
dipole: 0.8365855 1.1399353 -0.6448196 debye
dipolederiv: -0.4655805 -0.2000698 0.0622689 -0.3373051 -1.2855502 0.0391276 0.1350508 0.097207 -0.4344634 -0.2179323 0.0538325 0.0301951 0.4747732 0.4235508 -0.2547024 0.0876826 -0.1000742 -0.1909541 -0.2431718 0.3147105 -0.0513866 -0.3979869 -1.1568461 0.1126801 -0.2445419 -0.6098676 -0.2697169 -0.0093331 0.0685524 0.0794536 -0.0606837 -0.079828 -0.088548 0.0866509 -0.1210848 0.1363038 -0.0305005 -0.0230719 0.1078427 0.0298268 -0.0156927 0.0861563 0.1619597 0.0707183 -0.140322 0.2993715 -0.0486275 0.0623352 0.0262585 -0.0689838 -0.0232014 0.194477 -0.0106855 -0.0284354 0.1911806 -0.0485623 -0.1680434 -0.1416544 0.4161378 -0.0344452 -0.26271 0.1065669 0.0207394 0.2857161 -0.1304335 -0.205459 0.3827991 1.6346192 0.0325731 -0.1828264 0.4345747 0.5742343 -0.0047928 -0.0657714 0.0396166 -0.0036371 -0.1792599 0.0165645 0.073292 0.0628895 0.0349151 -0.1465719 -0.0212658 0.007926 0.0172765 -0.1507126 -0.0002642 -0.0541136 -0.0073603 0.0911037 -0.0819906 -0.0230108 -0.070765 0.0016537 -0.1131138 0.0084637 -0.1059201 0.0137099 -0.0608861 0.035245 -0.0395708 -0.0802025 -0.0532545 -0.1285237 0.0135925 -0.0990018 0.0122703 0.0217409 -0.0405218 -0.02704 0.0151272 -0.0278963 -0.1323479 -0.0151396 0.0340019 -0.0095275 0.1463364 0.0403918 -0.0583892 0.0618201 -0.0516541 -0.1470239 -0.0182051 0.0689548 -0.0203709 -0.052052 0.0230784 -0.0323494 0.0493187 0.0048316 0.0287259 0.0723785 0.0272107 0.099073 -0.0857123 0.0660867 0.0589605 0.064354 0.0733538 -0.0118082 -0.0328103 0.0424062 -0.0212885 0.0839628 -0.086326 -0.0180713 -0.1008766 -0.028116 0.0778394 0.0498805 -0.0811232 0.0124757 0.0032966 0.0538007 0.0883641 0.0679163 0.0432523 0.0178211 -0.0403404 0.0803269 -0.1079438 0.0307895 0.0969526 0.0225 -0.0455447 -0.0294173 0.0152377 0.0327021 -0.0511527 0.096065 -0.1020765 -0.1117759 -0.0701358 -0.0201504 -0.0514634 0.0635059 0.0192042 -0.0240018 -0.0162658 0.1000694 0.0920057 0.0208484 -0.0628719 0.0191183 0.1313246 0.0230338 -0.0339521 0.014531 -0.1084439 0.0065562 0.0354573 0.0934614 0.017152 0.1159566 -0.0157144 0.0986713 -0.0094429 0.046375 0.3250447 0.0288381 0.0586714 -0.0332292 0.1073898 0.0031918 0.0665204 0.0025389 0.2292636 -0.0580481 0.0416405 0.0961776 0.0425109 0.1456833 -0.0162546 0.1042984 -0.0185739 0.0072992 0.0722605 0.0159739 -0.0187097 0.0226652 0.1458106 0.0105914 -0.0459724 0.0107542 -0.1135157 -0.0911451 0.0566913 -0.0724748 0.060826 0.1460881 0.0194854 -0.0761874 0.0191112 0.0601484 unknown
polarizability: 149.0389606|0.1238539|116.1519849|-6.2111082|-5.8544119|120.4225461 unknown
InChI: InChI=1S/C11H12N2O/c1-8-10(7-11(14)13-12-8)9-5-3-2-4-6-9/h2-6,10,13H,7H2,1H3
charge 0 multiplicity 1
26 atoms
O  -2.348409 -2.514267 0.335874
N  -2.172752 1.114379 0.722912
N  -2.414865 -0.266558 0.908395
C  -0.47752 0.43227 -1.001085
C  -1.315351 -0.868645 -1.195356
C  0.903104 0.150745 -0.382451
C  -1.271341 1.450392 -0.180136
C  -2.038046 -1.318457 0.070023
C  -0.994093 2.91999 -0.368983
C  2.010652 -0.086594 -1.236528
C  1.096382 0.076914 1.02077
C  3.282013 -0.396558 -0.704561
C  2.367238 -0.233532 1.554813
C  3.463998 -0.472879 0.695623
H  -0.299818 0.866166 -2.003595
H  -0.687258 -1.701425 -1.55001
H  -2.097965 -0.693921 -1.96149
H  -1.577055 3.51696 0.349637
H  -1.254965 3.245034 -1.395009
H  0.082973 3.132147 -0.226907
H  1.877088 -0.026851 -2.324402
H  0.257316 0.268696 1.699232
H  -3.014916 -0.47687 1.708363
H  4.127329 -0.574158 -1.378865
H  2.500511 -0.289073 2.641033
H  4.448847 -0.712904 1.111305
