program: Gaussian 09
title: 000215552
version: EM64L-G09RevD.01
frameworkgroup: C1[X(C12H26NO4PS)]
method: RPBEPBE
basis: SDD
operation: Freq
keyword: #p
keyword: freq=noraman
keyword: PBEPBE/SDD
title: #p freq=noraman PBEPBE/SDD
converged: NO YES NO NO
title: Mulliken charges:
elementType: S P O O O O N C C C C C C C C C C C C H H H H H H H H H H H H H H H H H H H H H H H H H H
charge: -0.016916 1.086674 -0.294580 -0.512618 -0.479199 -0.612780 -0.136416 -0.110869 0.017074 0.311539 -0.675656 -0.664444 -0.706406 -0.707266 -0.828265 -0.241925 -0.246788 -0.639067 -0.640857 0.280021 0.189633 0.209559 0.227474 0.214745 0.205875 0.225693 0.227347 0.269905 0.215831 0.205909 0.270273 0.216992 0.206095 0.318677 0.308466 0.229391 0.235808 0.235641 0.224537 0.233328 0.235914 0.213261 0.255141 0.232987 0.210261
chargesum: 0.00000
title: Mulliken charges with hydrogens summed into heavy atoms:
elementType: S P O O O O N C C C C C C C C C C C C
charge: -0.016916 1.086674 -0.294580 -0.512618 -0.479199 -0.612780 -0.136416 0.169152 0.206707 0.311539 -0.023879 -0.005529 -0.014761 -0.013905 -0.201122 0.223274 0.213389 0.043436 0.057532
polarizability: 2.48369372e+02 4.42241306e+00 1.92284272e+02 1.77631786e+00 4.71209897e+00 1.66026634e+02
1716.lowfreq: -15.3891 -13.5922 -4.7166 -2.8934 -0.0001 0.0009 0.0013 16.1086 31.0866
frequency: -12.0321 15.7268 30.8824 40.7126 44.8444 55.2435 64.1378 73.4810 84.2074 85.9279 105.0800 125.3956 131.9285 160.9326 170.1007 192.2225 200.1013 210.3639 214.1195 218.6949 228.3139 235.6153 238.7889 241.7439 246.2471 286.3793 307.6820 316.5373 331.9910 347.2610 352.5984 389.4943 415.6814 432.0477 455.2502 457.3948 491.3535 502.3152 560.5880 590.4256 610.1984 663.1003 668.3345 739.0780 797.4842 806.7782 851.8074 859.1825 863.6279 871.7696 905.5538 914.7147 922.4518 942.2159 945.2333 951.6743 1003.9132 1012.5275 1021.8794 1032.4811 1092.8538 1094.2838 1120.6706 1131.6373 1140.2192 1143.6049 1147.4552 1149.9488 1166.0760 1177.4089 1205.7592 1258.3939 1261.5165 1266.0701 1309.1846 1315.1947 1323.3381 1344.4484 1346.9972 1367.3876 1369.9531 1375.6777 1383.8972 1391.4757 1392.0019 1392.3860 1413.6862 1454.5778 1456.5165 1456.9280 1458.5971 1462.2295 1467.2177 1469.1000 1470.6594 1471.5891 1478.6346 1482.7168 1486.0755 1487.4015 1487.9352 1500.9210 1572.5150 2981.1922 2985.0583 2985.9735 2988.7281 2989.0303 2989.9531 2994.9168 3007.7932 3016.9537 3034.8152 3062.0305 3074.2814 3075.7435 3076.0919 3079.3008 3080.1606 3085.7020 3086.1156 3087.5988 3090.3297 3095.7542 3108.1214 3112.1123 3115.1442 3117.5457 3138.6763
redmass: 3.1766 3.7232 3.0732 3.3918 3.4576 4.4628 4.0393 2.9367 3.1341 2.7371 6.7411 3.9706 4.5474 2.4164 3.1076 2.9220 1.1210 2.0602 2.0172 1.2519 2.1978 1.2994 1.4250 1.3265 1.9084 9.3059 2.5222 3.6412 2.8805 3.4214 3.5628 3.5765 4.4675 2.5588 5.6375 3.7834 2.7906 4.7567 4.9208 3.2891 6.8586 5.2047 3.5417 7.0621 1.1185 1.1157 2.5461 3.7063 4.0454 2.4719 1.9809 1.2754 1.2127 1.3513 1.4219 2.1986 2.6187 2.8658 5.9930 2.4138 2.1817 2.2044 1.4836 2.4328 1.5390 1.5166 1.9135 2.4566 1.9772 1.7284 2.6250 1.1813 1.1248 1.1238 2.0371 1.4267 1.3482 1.2228 1.2173 1.2391 1.2083 1.2031 1.2400 1.2343 1.2271 1.2281 1.7238 1.0622 1.0769 1.0412 1.0596 1.0500 1.0547 1.0622 1.0627 1.0713 1.0511 1.0631 1.0510 1.0565 1.0571 1.0654 5.7848 1.0349 1.0358 1.0363 1.0363 1.0376 1.0409 1.0598 1.0611 1.0827 1.0623 1.0891 1.0997 1.1034 1.0999 1.1011 1.0991 1.0987 1.0990 1.0968 1.0991 1.0950 1.1032 1.0995 1.1025 1.0988 1.1039
irintensity: 0.5618 1.3362 1.1547 0.3422 1.1013 3.3569 2.2675 0.2102 1.8821 0.4468 4.7898 1.9681 1.5338 0.2844 2.4041 1.1396 0.0879 3.4431 2.2052 0.2069 2.9917 1.4833 4.9356 0.6191 0.4166 9.4253 0.0985 3.3266 0.4687 6.5676 12.3731 6.8891 59.7240 3.6325 42.4785 27.5667 4.1396 1.4015 14.9949 25.8500 157.6534 59.5053 40.4891 1.5834 8.2210 7.0016 2.8152 97.0607 161.9535 1.2623 1.1897 3.1991 3.1508 0.0469 0.0434 7.0680 159.3552 72.5066 80.0503 64.5710 8.5330 5.7185 37.5660 3.7257 5.3731 9.0618 14.3885 19.3402 15.3989 10.3999 35.6858 3.4985 0.7207 0.1356 134.5853 28.2414 18.5883 16.5332 9.5703 10.3138 20.8768 34.1976 53.7857 18.0344 17.5830 32.1231 32.7580 6.5195 18.9787 7.5959 26.7502 3.1871 1.5878 31.0147 8.2882 4.1797 16.9898 14.7752 1.7369 2.6120 21.3886 20.4602 208.6163 16.1087 17.0027 39.3923 12.8236 38.7387 16.8699 25.9268 25.1979 23.5819 3.6363 33.3800 14.0871 2.8686 2.2770 4.9374 69.4380 21.2887 25.0846 25.5583 36.3726 34.9703 33.3902 1.1141 26.3874 18.9188 0.8215
temp: 298.150 k
press: 1.00000 atm
elementType: 16 15 8 8 8 8 7 6 6 6 6 6 6 6 6 6 6 6 6 1 1 1 1 1 1 1 1 1 1 1 1 1 1 1 1 1 1 1 1 1 1 1 1 1 1
symmnumber: 1
zpe: 982373.8 jmol-1
zpe.correction: 0.374166 hartree
zpe.thermalcorrener: 0.399390 hartree
zpe.thermalcorrenthalpy: 0.400334 hartree
zpe.thermalcorrgfe: 0.317634 hartree
zpe.sumelectzpe: -1566.240644 hartree
zpe.sumelectthermal: -1566.215420 hartree
zpe.sumelectthermalent: -1566.214476 hartree
zpe.sumelectthermalfe: -1566.297176 hartree
dipole: 1.5031 3.2829 -1.1032
dipole: 3.7754
quadrupole: -123.1620 -127.3695 -141.6654
quadrupole: -12.1998 -11.7706 -5.7644
quadrupole: 7.5703 3.3628 -10.9331 -12.1998 -11.7706 -5.7644
hfenergy: -1566.6148103 hartree
pointgroup: C01 [X(C12H26N1O4P1S1)]
dipole: 0.5043557 0.950459 1.0239966 debye
polarizability: 244.1429572|-7.7828096|168.7273172|15.1818514|6.9330063|193.8100048 unknown
InChI: InChI=1S/C8H16NOS.C4H10O3P/c1-6(2)9(7(3)4)8(10)5-11;1-3-6-8(5)7-4-2/h6-7H,5H2,1-4H3;3-4H2,1-2H3
charge 0 multiplicity 1
45 atoms
S  0.958103 0.349701 -1.26122
P  1.981218 -0.726731 0.514816
O  -2.170605 -0.124707 -3.00926
O  2.890005 0.538309 1.271831
O  3.232404 -1.727828 -0.095891
O  0.948099 -1.523733 1.427631
N  -2.523322 0.086514 -0.70726
C  -2.092133 -0.120895 0.71173
C  -3.867818 0.725361 -0.931584
C  -1.77363 -0.29318 -1.806788
C  -1.974423 1.221816 1.472521
C  -3.017236 -1.122071 1.444799
C  -3.744748 2.083606 -1.661573
C  -4.856973 -0.234737 -1.634099
C  -0.405394 -0.962353 -1.598852
C  2.227521 1.41023 2.295718
C  4.185778 -1.250303 -1.146535
C  1.88438 2.772722 1.693282
C  5.396918 -0.547079 -0.533009
H  -1.084852 -0.564674 0.698901
H  -4.261304 0.925122 0.082327
H  -2.952516 1.721754 1.593027
H  -1.292656 1.909856 0.941993
H  -1.568973 1.033597 2.483459
H  -4.044812 -0.730731 1.560363
H  -3.069518 -2.08093 0.899493
H  -2.615175 -1.324577 2.453483
H  -3.360667 1.939749 -2.68371
H  -3.064158 2.763468 -1.118115
H  -4.739313 2.563339 -1.720747
H  -4.516258 -0.459529 -2.656783
H  -4.952138 -1.182076 -1.073472
H  -5.855448 0.237574 -1.687451
H  -0.139551 -1.439897 -2.551462
H  -0.372692 -1.696638 -0.776577
H  1.336763 0.891652 2.698416
H  2.981155 1.493299 3.096707
H  4.468994 -2.184939 -1.658314
H  3.64148 -0.600854 -1.860543
H  2.788567 3.258594 1.288809
H  1.145474 2.674258 0.879407
H  1.459354 3.429745 2.475522
H  5.097345 0.373543 -0.005373
H  5.910268 -1.210923 0.183064
H  6.111787 -0.283026 -1.335475
