program: Gaussian 09
title: 000215565
version: EM64L-G09RevD.01
frameworkgroup: C1[X(C20H23F2NO)]
method: RPBEPBE
basis: SDD
operation: Freq
keyword: #p
keyword: freq=noraman
keyword: PBEPBE/SDD
title: #p freq=noraman PBEPBE/SDD
converged: YES YES NO NO
title: Mulliken charges:
elementType: F F O N C C C C C C C C C C C C C C C C C C C C H H H H H H H H H H H H H H H H H H H H H H H
charge: -0.209790 -0.207322 -0.478390 -0.083895 -0.105191 -0.372817 0.037380 -0.436673 -0.427411 -0.446870 -0.443021 -0.760937 0.418414 0.442567 -0.522808 -0.566223 -0.416163 -0.411724 0.317765 0.302404 -0.178605 -0.179691 -0.397287 -0.395608 0.200453 0.228749 0.208535 0.210018 0.228229 0.210442 0.230541 0.215630 0.226386 0.230215 0.219895 0.271872 0.179517 0.242880 0.344315 0.261938 0.269165 0.289954 0.275969 0.230844 0.231891 0.255867 0.258590
chargesum: 0.00000
title: Mulliken charges with hydrogens summed into heavy atoms:
elementType: F F O N C C C C C C C C C C C C C C C C C C C C
charge: -0.209790 -0.207322 -0.134075 -0.083895 0.095262 0.064467 0.037380 0.001573 0.013573 -0.004854 0.007089 -0.066668 0.418414 0.442567 -0.260870 -0.297058 -0.126209 -0.135756 0.317765 0.302404 0.052239 0.052201 -0.141420 -0.137017
polarizability: 2.40584965e+02 -1.59452715e+01 2.09009870e+02 4.13665965e+00 -8.03642013e+00 2.03116839e+02
1716.lowfreq: -20.5293 -6.1040 -0.0012 0.0001 0.0010 4.1693 8.8764 25.7276 31.8541
frequency: -14.1747 25.5356 31.8359 39.3485 44.4419 48.2297 51.5897 82.4724 108.6564 127.8053 185.0492 200.7983 218.7319 220.7926 231.2311 232.7142 251.4740 262.2370 289.2492 304.8340 316.9788 340.1639 359.5245 383.9140 392.6346 426.2366 439.7593 448.4206 464.5123 498.2856 506.8286 522.9108 567.4708 578.4879 613.4834 634.2896 638.0971 656.8437 687.4958 694.0047 714.5718 763.9548 780.3149 795.6651 799.7702 824.3648 831.7073 850.1947 866.8925 877.2524 879.1902 894.2981 900.6973 910.3264 913.2337 919.3147 934.9469 942.2918 965.3488 976.1600 985.4848 988.3010 989.4287 992.6559 1020.0386 1046.7726 1058.9868 1070.9126 1076.6329 1078.3505 1107.0492 1114.8393 1120.7244 1134.3643 1165.4153 1170.7233 1171.6768 1173.5194 1190.9758 1198.7649 1217.8936 1219.2325 1250.9274 1265.1638 1268.4099 1281.9932 1284.7806 1289.1523 1297.5239 1312.0529 1316.1586 1321.9333 1326.7521 1359.2981 1379.0103 1381.9050 1385.0960 1424.1162 1430.6398 1457.9443 1462.8151 1468.0462 1469.7414 1471.3856 1472.5845 1475.1094 1486.8495 1493.8202 1588.9903 1591.8782 1614.9742 1619.1592 2926.6214 2963.4655 2981.8542 2982.8351 2993.1364 3003.1231 3018.8254 3036.5155 3052.5016 3060.4900 3066.1752 3074.2125 3088.5204 3097.2677 3142.5759 3143.7584 3159.8709 3162.4564 3167.5725 3177.1318 3180.7858 3190.0629 3563.2111
redmass: 3.2400 4.5401 4.2113 3.4137 2.7088 5.2728 4.5309 3.6838 2.5526 4.6551 5.0228 4.2472 1.3981 2.4152 5.1367 4.1943 3.8907 5.0347 3.6683 2.6124 2.4538 2.1102 5.7849 1.8951 2.4211 4.8462 3.2616 3.1663 3.3037 6.2728 8.1405 4.3737 4.9752 4.3404 2.3045 4.2247 5.4578 3.9421 3.5562 2.4744 2.3456 2.1426 2.4411 1.5014 1.5868 3.0889 2.4723 2.2583 1.8335 2.7850 2.3771 1.5731 2.1801 1.3793 1.4915 1.5713 1.7445 2.5213 2.5157 2.2337 1.5141 5.9077 3.7840 1.4597 2.8329 2.7443 1.9135 1.9240 1.5981 1.5659 2.0458 2.0506 1.9076 1.9695 1.8666 1.1601 1.2533 1.2120 2.2766 1.5204 1.3770 3.0840 1.3087 1.3974 1.4840 1.3502 1.3175 1.3836 1.2765 1.4295 1.2473 1.6545 1.3533 1.3072 1.7238 4.2044 4.1472 3.0971 3.1741 1.0755 1.0807 1.0689 2.4790 1.0887 2.4776 1.0877 1.0943 1.0488 6.5647 6.6461 7.2749 7.1431 1.0664 1.0441 1.0674 1.0784 1.0633 1.0593 1.0640 1.0936 1.1014 1.0902 1.1015 1.1010 1.1060 1.1000 1.0876 1.0885 1.0916 1.0914 1.0929 1.0944 1.0980 1.0954 1.0652
irintensity: 0.2932 0.5648 0.2577 0.2384 0.2048 0.1356 0.7262 0.2156 0.0346 0.8888 0.6909 7.7846 0.2852 0.1013 1.3836 2.5028 0.0093 0.7218 3.4260 41.6941 63.6724 70.4603 12.8312 1.8575 6.0033 10.2883 4.0881 4.3894 0.8954 7.5080 2.6108 3.8230 3.5840 11.9403 3.0788 2.4676 2.5132 3.4944 1.5241 15.0387 41.9978 13.4611 65.0807 60.4750 26.0222 27.7218 43.2419 18.4229 36.8271 10.4419 9.2644 16.8399 7.0166 2.9927 0.2430 2.1874 11.9166 18.5352 8.2370 37.9182 1.2405 0.5189 3.3149 1.5962 11.8624 0.4727 45.6780 28.2750 4.3198 6.8091 1.5668 6.5210 12.7580 19.5487 2.4556 8.2479 3.9089 1.5041 78.9966 9.2127 9.3419 54.1770 9.7255 5.0759 4.7490 7.5984 1.7777 1.8171 1.5665 1.8200 4.6836 22.7717 14.9105 1.6289 19.6975 8.5711 7.2874 3.8025 65.6950 2.9673 1.0482 16.1853 30.5509 13.8874 43.6281 4.2533 7.1764 10.9051 16.9853 80.8111 58.3746 26.4696 48.0528 28.7184 42.0836 30.7994 37.4980 40.1354 46.9026 19.0500 23.4519 30.9633 1.4923 21.3607 112.7996 13.2529 8.7953 13.1943 1.0385 3.9650 2.1410 3.3619 7.0386 4.7846 7.0642
temp: 298.150 k
press: 1.00000 atm
elementType: 9 9 8 7 6 6 6 6 6 6 6 6 6 6 6 6 6 6 6 6 6 6 6 6 1 1 1 1 1 1 1 1 1 1 1 1 1 1 1 1 1 1 1 1 1 1 1
symmnumber: 1
zpe: 1006309.4 jmol-1
zpe.correction: 0.383283 hartree
zpe.thermalcorrener: 0.405154 hartree
zpe.thermalcorrenthalpy: 0.406098 hartree
zpe.thermalcorrgfe: 0.331017 hartree
zpe.sumelectzpe: -1103.788472 hartree
zpe.sumelectthermal: -1103.766601 hartree
zpe.sumelectthermalent: -1103.765657 hartree
zpe.sumelectthermalfe: -1103.840737 hartree
dipole: -1.3352 -0.5627 -2.9984
dipole: 3.3301
quadrupole: -132.5450 -144.0644 -143.9117
quadrupole: 0.3034 -8.1683 -2.6941
quadrupole: 7.6287 -3.8907 -3.7380 0.3034 -8.1683 -2.6941
hfenergy: -1104.1717548 hartree
pointgroup: C01 [X(C20H23F2N1O1)]
dipole: -0.5471607 0.1086095 -1.1854635 debye
polarizability: 234.9539139|-20.1423524|217.6228723|-1.1626753|-5.6318258|200.1348878 unknown
InChI: InChI=1S/C20H23F2NO/c1-15(14-23-10-2-3-11-23)20(24,16-6-4-8-18(21)12-16)17-7-5-9-19(22)13-17/h4-9,12-13,15,24H,2-3,10-11,14H2,1H3
charge 0 multiplicity 1
47 atoms
F  0.391198 2.868448 2.90643
F  3.661216 -2.76444 1.939581
O  0.259691 -0.143327 -2.409837
N  -3.222926 -1.377726 0.00019
C  -0.755867 -1.216835 -0.413827
C  -2.156709 -0.609764 -0.703836
C  0.392929 -0.281842 -0.940991
C  -4.569528 -1.271535 -0.631362
C  -3.464146 -0.905664 1.398712
C  -5.196009 0.057672 -0.097554
C  -4.566068 0.217649 1.324564
C  -0.679146 -2.650433 -0.986932
C  0.259475 1.149204 -0.37652
C  1.813633 -0.808058 -0.612243
C  0.395423 1.364421 1.017874
C  2.08713 -1.594061 0.534745
C  0.003794 2.253214 -1.225891
C  2.892265 -0.433751 -1.456091
C  0.257925 2.668653 1.514308
C  3.412618 -1.976806 0.79425
C  -0.120942 3.555533 -0.6900
C  4.213548 -0.837038 -1.165627
C  0.001468 3.783673 0.699111
C  4.495546 -1.622435 -0.024552
H  -0.654232 -1.27866 0.688923
H  -2.162315 0.468379 -0.429359
H  -2.345076 -0.663425 -1.792164
H  -5.181137 -2.13261 -0.296523
H  -4.491782 -1.317864 -1.730629
H  -2.524236 -0.548573 1.854562
H  -3.83143 -1.755625 2.004007
H  -6.299156 0.017566 -0.070198
H  -4.906661 0.902964 -0.748131
H  -4.128315 1.222298 1.456952
H  -5.318117 0.078437 2.121296
H  -1.536524 -3.221516 -0.592064
H  -0.776762 -2.653551 -2.092013
H  0.255554 -3.172405 -0.720529
H  0.355846 -1.047269 -2.803888
H  0.624304 0.550585 1.712684
H  1.30165 -1.923325 1.221144
H  -0.096521 2.075719 -2.29861
H  2.682066 0.182672 -2.334999
H  -0.31762 4.40103 -1.357889
H  5.033304 -0.535577 -1.826305
H  -0.091156 4.78086 1.138542
H  5.509097 -1.947963 0.225693
