program: Gaussian 09
title: 000215522
version: EM64L-G09RevD.01
frameworkgroup: C1[X(C17H21N3O2)]
method: RPBEPBE
basis: SDD
operation: Freq
keyword: #p
keyword: freq=noraman
keyword: PBEPBE/SDD
title: #p freq=noraman PBEPBE/SDD
converged: YES YES NO NO
title: Mulliken charges:
elementType: O O N N N C C C C C C C C C C C C C C C C C H H H H H H H H H H H H H H H H H H H H H
charge: -0.225408 -0.265214 -0.145713 -0.375972 0.045175 -0.398781 -0.390218 -0.389234 -0.373390 -0.364870 -0.446798 0.174517 0.167184 0.156751 0.163923 0.223544 -0.388093 -0.361380 -0.360203 -0.776548 -0.250814 -0.212939 0.194991 0.219713 0.196437 0.204982 0.200944 0.199786 0.234023 0.193324 0.183704 0.217849 0.232410 0.244496 0.334033 0.196497 0.307915 0.249039 0.251705 0.225848 0.251559 0.228242 0.226985
chargesum: 0.00000
title: Mulliken charges with hydrogens summed into heavy atoms:
elementType: O O N N N C C C C C C C C C C C C C C C C C
charge: -0.225408 -0.265214 -0.145713 -0.041939 0.045175 0.015923 0.011200 0.011496 0.053956 0.036683 0.030108 0.174517 0.167184 0.156751 0.163923 0.223544 -0.191596 -0.053465 -0.111163 -0.047436 -0.022572 0.014047
polarizability: 3.18220525e+02 1.32047895e+01 2.51183175e+02 9.87244816e+00 -5.83606988e+00 1.25643538e+02
1716.lowfreq: -5.8454 -3.7847 -0.0003 0.0007 0.0009 2.6454 16.9057 27.7344 36.5217
frequency: 16.8632 27.7149 36.5039 56.2331 68.7898 78.1792 92.7341 123.8535 125.1186 143.4324 192.2802 206.3568 226.9494 237.7624 273.9420 279.0303 303.3598 318.8804 321.8196 359.9912 380.0370 407.7641 420.0277 438.1474 449.3286 475.3359 480.5456 534.1017 556.1059 564.4799 589.3191 603.9286 645.1019 648.6299 673.6915 748.3804 759.0087 765.9945 770.5584 800.6415 827.4081 829.2123 853.5039 856.4432 874.3534 894.9552 898.6655 919.9223 951.4863 953.6238 954.5538 977.6963 994.7632 996.3921 1004.0221 1021.6852 1040.1846 1047.6484 1070.1419 1078.5325 1090.0257 1108.6945 1118.5889 1141.9117 1148.1549 1153.5192 1157.6985 1167.8539 1175.6793 1184.1619 1235.1790 1254.0365 1263.3252 1273.5027 1278.7908 1291.8852 1315.5519 1325.6892 1333.6349 1340.3274 1349.7102 1361.0825 1376.5562 1387.7449 1404.2623 1411.5597 1438.1707 1448.8638 1451.2419 1453.1794 1460.6509 1462.6320 1466.4740 1469.7615 1470.3019 1479.7014 1488.4917 1553.7771 1594.0730 1621.8276 1627.1914 1646.9091 2865.9186 2873.1457 2943.6815 2973.5395 2974.0449 2982.6787 2982.8956 2984.9474 3026.7336 3031.3722 3032.6784 3040.5454 3046.3879 3055.7806 3057.8706 3102.2138 3134.8338 3153.7492 3173.6962 3181.9945 3217.1418
redmass: 4.7523 4.7527 3.1460 5.0040 3.8745 5.1940 1.1103 3.4200 3.5106 5.2861 5.0483 3.1162 2.8909 1.8984 4.8769 3.2410 4.5110 4.3519 2.0887 5.2303 2.5260 2.9910 5.0114 3.2906 2.8489 2.9679 4.3422 4.5980 3.0567 4.2276 3.2938 3.8859 4.5827 5.6493 5.0334 5.0038 3.0913 1.5275 3.8370 1.4610 1.2071 4.1120 2.7652 1.4149 1.3575 2.4043 4.0684 1.5245 3.8510 1.3592 1.3753 2.0419 2.4697 1.3034 2.2235 2.3861 1.4665 2.1485 5.1043 1.4648 2.5813 2.6061 2.6909 1.8755 1.6429 1.6841 1.9684 1.8118 1.7363 1.3079 3.3075 1.3589 1.2770 1.2780 1.4906 1.3444 1.4524 1.4441 1.3292 1.4219 1.4838 1.4203 1.5275 2.2792 2.2201 2.4389 2.6521 1.0921 1.0437 1.0936 1.0874 1.3900 1.1893 1.2217 1.4164 1.3077 1.7613 7.1366 7.2110 6.6457 8.1062 9.8458 1.0707 1.0696 1.0655 1.0852 1.0635 1.0400 1.0598 1.0620 1.0901 1.0918 1.0929 1.0949 1.1022 1.1039 1.0978 1.0974 1.0863 1.0920 1.0965 1.0980 1.0759
irintensity: 0.1848 0.5681 0.0847 3.7877 0.0490 7.8064 0.6972 4.2739 2.1646 0.9206 3.2613 5.8414 0.3237 0.7408 1.3087 2.2329 2.4622 0.1681 9.1180 17.6059 5.3917 29.2093 1.5379 4.0725 0.9214 4.9611 2.2794 5.3179 1.6136 0.8119 2.1023 2.9977 1.9512 5.3148 1.2066 2.4322 26.9857 70.9282 19.2981 4.4264 53.9402 19.1444 4.6670 6.2652 0.4468 0.4138 89.8845 27.9768 3.6201 4.8188 8.5113 18.3328 21.7148 1.4803 10.8890 17.1169 3.9112 7.7234 51.1051 5.6227 28.8959 33.5322 4.3176 39.0732 13.8311 14.4994 45.7808 62.4025 45.2059 4.2593 27.7191 6.2943 0.0994 18.0842 17.0198 5.1676 11.8657 67.9144 0.7762 0.2989 0.9491 0.2924 41.6550 18.1361 1.5473 18.2177 40.9428 30.2925 11.2650 7.5056 13.9939 17.5126 61.7966 18.4517 6.3969 42.8079 311.1392 18.3518 4.7164 159.6109 0.6285 261.5762 41.1257 157.6812 57.8333 67.7373 26.8396 24.8737 32.3657 27.0695 29.4255 42.2196 40.5608 33.1107 26.2390 103.6909 11.1577 16.7215 5.0301 17.8264 9.1788 14.2194 184.5447
temp: 298.150 k
press: 1.00000 atm
elementType: 8 8 7 7 7 6 6 6 6 6 6 6 6 6 6 6 6 6 6 6 6 6 1 1 1 1 1 1 1 1 1 1 1 1 1 1 1 1 1 1 1 1 1
symmnumber: 1
zpe: 926294.5 jmol-1
zpe.correction: 0.352807 hartree
zpe.thermalcorrener: 0.373119 hartree
zpe.thermalcorrenthalpy: 0.374063 hartree
zpe.thermalcorrgfe: 0.301749 hartree
zpe.sumelectzpe: -973.458356 hartree
zpe.sumelectthermal: -973.438044 hartree
zpe.sumelectthermalent: -973.437100 hartree
zpe.sumelectthermalfe: -973.509413 hartree
dipole: -4.5447 4.9523 -0.4163
dipole: 6.7345
quadrupole: -107.1766 -133.3287 -131.0347
quadrupole: -2.7324 1.4781 -0.5149
quadrupole: 16.6700 -9.4821 -7.1880 -2.7324 1.4781 -0.5149
hfenergy: -973.8111627 hartree
pointgroup: C01 [X(C17H21N3O2)]
dipole: -1.7490663 -1.0959345 -1.661272 debye
polarizability: 316.0222099|16.2280093|153.7833092|-21.7147562|50.1619294|225.2417192 unknown
InChI: InChI=1S/C17H21N3O2/c1-13-15(14-7-3-4-8-16(14)22-13)11-18-19-17(21)12-20-9-5-2-6-10-20/h3-4,7-8,11,19H,2,5-6,9-10,12H2,1H3
charge 0 multiplicity 1
43 atoms
O  -1.349145 1.160988 3.136778
O  4.027752 -0.610405 -1.553872
N  -3.943458 -0.25329 0.923882
N  -1.286513 -0.032863 1.095384
N  0.073782 0.102732 0.886905
C  -5.856646 -0.552584 -1.295941
C  -4.73328 0.509544 -1.325077
C  -5.44126 -1.744856 -0.403588
C  -4.339112 0.929894 0.104413
C  -5.038089 -1.261608 1.003638
C  -3.412201 0.1480 2.251089
C  -1.908493 0.505472 2.219036
C  1.986491 -0.354335 -0.489297
C  3.014772 0.284753 0.338022
C  4.246433 0.105014 -0.347293
C  2.636243 -0.875742 -1.609267
C  0.566684 -0.443992 -0.210791
C  3.009668 0.977088 1.573997
C  5.482497 0.570099 0.117342
C  2.179843 -1.630494 -2.81294
C  4.243817 1.45675 2.066321
C  5.460084 1.258623 1.353609
H  -6.783461 -0.096408 -0.890792
H  -6.089382 -0.898372 -2.32046
H  -3.84344 0.094706 -1.838828
H  -5.054109 1.404126 -1.891736
H  -6.267815 -2.475419 -0.316599
H  -4.579724 -2.268533 -0.86246
H  -3.487001 1.634452 0.080356
H  -5.19729 1.464475 0.584236
H  -5.936541 -0.834993 1.517071
H  -4.680259 -2.112334 1.612877
H  -3.947084 1.014006 2.699059
H  -3.523569 -0.696705 2.957787
H  -1.942303 -0.522612 0.448424
H  -0.069413 -0.98421 -0.940438
H  2.071343 1.125807 2.114434
H  6.407305 0.408522 -0.44323
H  2.682517 -2.613229 -2.879962
H  1.091423 -1.800653 -2.779324
H  2.415414 -1.078159 -3.741672
H  4.267413 1.99503 3.020117
H  6.397802 1.645116 1.76759
