program: Gaussian 09
title: 000215569
version: EM64L-G09RevD.01
frameworkgroup: C1[X(C23H33NO3)]
method: RPBEPBE
basis: SDD
operation: Freq
keyword: #p
keyword: freq=noraman
keyword: PBEPBE/SDD
title: #p freq=noraman PBEPBE/SDD
converged: YES YES NO NO
title: Mulliken charges:
elementType: O O O N C C C C C C C C C C C C C C C C C C C C C C C H H H H H H H H H H H H H H H H H H H H H H H H H H H H H H H H H
charge: -0.281920 -0.295250 -0.460066 0.022086 -0.272372 0.219060 0.208765 0.282316 0.344287 0.304736 0.281244 -0.387354 -0.273701 -0.258595 -0.260225 -0.439258 -0.449652 -0.427570 -0.439004 -0.598794 -0.576478 -0.860439 -0.842819 -0.832571 -0.862322 -0.241517 -0.241617 0.185183 0.267421 0.243466 0.234175 0.179637 0.196695 0.217986 0.208350 0.195724 0.232442 0.230690 0.232353 0.228927 0.258271 0.225261 0.249683 0.252888 0.249501 0.232868 0.249190 0.235330 0.228295 0.230434 0.208799 0.259426 0.202144 0.240605 0.269552 0.225954 0.257144 0.257749 0.225566 0.227323
chargesum: 0.00000
title: Mulliken charges with hydrogens summed into heavy atoms:
elementType: O O O N C C C C C C C C C C C C C C C C C C C C C C C
charge: -0.281920 -0.295250 -0.460066 0.022086 -0.087189 0.219060 0.208765 0.282316 0.344287 0.304736 0.281244 0.123533 0.140111 0.156085 0.143849 -0.206816 -0.218962 -0.195217 -0.210077 0.134421 0.158779 -0.147624 -0.144160 -0.120270 -0.121475 -0.015951 -0.014294
polarizability: 2.89255552e+02 2.41799731e+01 2.85200085e+02 3.48043089e-01 7.86755958e+00 2.34079156e+02
1716.lowfreq: -9.1406 0.0002 0.0003 0.0007 4.2080 9.0985 11.2607 15.8927 24.0397
frequency: 10.0047 14.7093 23.3925 36.0526 47.1280 61.5227 66.8764 72.0186 84.5430 107.6660 121.2074 132.9850 148.1890 158.8084 178.9069 202.2686 206.0064 214.7665 220.2487 221.3919 228.7698 231.3538 253.1749 262.1291 268.7121 284.6295 292.8954 298.0297 314.0941 327.6602 344.6590 346.2429 352.0586 383.0778 396.5485 438.1051 454.4263 456.0291 473.0985 490.3792 508.6973 520.9037 523.7516 528.7735 531.0901 538.6183 540.0556 559.2592 587.7951 675.6571 693.8734 706.2145 739.8223 756.8682 776.5061 777.8423 783.5949 817.0231 821.6181 837.1287 851.7029 883.5885 886.9308 896.8449 902.8492 910.8563 916.9349 928.7697 953.8271 978.7271 980.3015 995.0938 995.4950 1015.7382 1032.6674 1035.0392 1037.9775 1041.1926 1042.1934 1042.9055 1045.4049 1052.8394 1054.7517 1077.8796 1090.5838 1092.6748 1103.0040 1109.3485 1148.0999 1160.4711 1162.7025 1176.0877 1177.8828 1200.2355 1208.8651 1216.1238 1239.6058 1249.4759 1254.1052 1256.1194 1257.0510 1261.2114 1276.9424 1294.7216 1329.6064 1335.3930 1344.6725 1355.5499 1370.9844 1384.4662 1389.9641 1390.9872 1399.0407 1403.3767 1405.6148 1409.9343 1416.0333 1425.5398 1431.4227 1436.3829 1439.9147 1450.2161 1451.2031 1452.7127 1458.4271 1461.3185 1464.3863 1466.2357 1471.2122 1473.7053 1475.4703 1476.6619 1482.2810 1484.6128 1485.2337 1485.8523 1488.6317 1590.9475 1592.9651 1600.7648 1603.0078 2916.9734 2922.8225 2928.3933 2943.7524 2965.1287 2966.3555 2980.0003 2980.3799 2993.9797 2995.1843 2998.5104 3002.8903 3015.5196 3041.6542 3042.4802 3052.3712 3066.0398 3080.8828 3083.2907 3083.9899 3090.6819 3092.0548 3113.5061 3114.5663 3115.4595 3116.7160 3124.6294 3125.9395 3137.8904 3142.7470 3147.5265 3153.1000 3153.5937
redmass: 4.7139 3.7186 4.5827 3.7276 3.8663 3.4958 4.2526 4.2200 3.6187 2.9805 4.1399 2.8529 3.0011 1.3239 1.0705 1.7955 2.1716 2.2914 3.4891 1.2439 2.3073 1.6254 1.8398 1.5733 2.3112 2.8574 1.7457 2.8499 2.2023 3.9603 2.4586 2.9223 2.6916 2.6753 3.1455 2.8659 3.1029 2.9406 2.9611 3.8835 3.2065 4.2968 3.1773 3.3256 5.2924 2.8679 4.0754 4.3417 3.7309 3.6053 3.6399 5.4240 3.4084 4.7650 2.3149 1.2607 1.2469 4.5132 4.9821 3.6000 2.8514 3.1761 2.4062 1.3098 1.3142 2.9175 2.4455 2.6629 4.9164 1.3601 1.3378 1.5721 1.5579 2.8123 1.7819 1.8046 1.7515 1.6355 1.6709 2.1588 1.6948 1.5766 1.8461 2.6099 1.9340 2.1200 1.9304 1.9918 1.6666 2.3737 1.5463 1.1755 1.2275 1.1039 3.2304 1.5087 1.3841 1.7206 2.4147 1.3799 1.9120 2.3128 1.4279 1.3565 1.6552 1.3009 1.2820 5.3773 1.5825 1.6600 1.2458 1.1513 1.2247 1.2548 1.3642 1.2269 1.2430 2.4496 2.0564 1.0995 1.0884 1.5526 1.3843 1.7224 1.0789 1.0966 1.0825 1.0965 1.0829 1.0905 1.0488 1.0730 1.1088 1.0983 1.1566 1.1313 1.1743 7.3579 6.8096 5.6038 5.5855 1.0798 1.0606 1.0590 1.0583 1.0397 1.0425 1.0831 1.0521 1.1015 1.0378 1.0373 1.0999 1.0302 1.0952 1.0603 1.0893 1.0982 1.0980 1.0982 1.0981 1.0995 1.0970 1.1031 1.1010 1.0859 1.0855 1.0914 1.0917 1.1044 1.1033 1.1029 1.0994 1.0998
irintensity: 0.6277 0.2700 0.9501 0.7125 2.0134 0.9924 1.5572 4.0633 1.3606 1.6720 7.0497 2.2369 0.6658 0.0803 0.1414 2.3302 6.0586 1.2532 0.6969 1.8100 0.4425 0.1091 2.9451 1.0367 2.2844 4.6665 6.7775 7.8884 3.8612 9.0298 2.5700 1.9538 1.6258 10.3100 2.0499 1.0192 5.6829 6.8532 4.3402 3.4558 7.1042 1.8963 0.4693 0.6632 0.4796 5.1158 5.2949 0.8286 1.0996 3.4733 6.3679 9.5431 11.5944 1.2845 7.7198 47.9356 48.5939 4.4461 11.6164 2.5574 10.7262 20.4161 6.0722 0.0505 0.0998 8.2296 22.8565 1.4878 101.5681 1.2647 0.0508 12.0761 0.7516 59.6922 4.1188 8.8438 13.1259 14.6439 5.1910 20.9169 13.1541 19.9855 7.3176 73.3306 6.3772 1.5112 14.2652 10.1765 18.3594 6.0917 15.3577 1.8060 3.7445 5.3100 6.7811 12.3236 0.4433 4.7450 0.3731 6.8586 1.5858 1.1168 1.4389 24.3509 7.0101 7.4852 19.8059 0.9569 1.1006 5.1894 14.7715 7.7364 5.7024 17.1610 7.0847 7.7375 2.3151 2.4104 4.5630 5.2026 7.1933 6.4706 7.3376 12.7793 7.8511 24.2484 6.0790 27.9057 7.7835 19.2424 19.0170 12.5562 23.5630 23.4704 13.1723 11.6557 35.5326 11.1240 10.9145 3.8343 2.3606 18.6793 18.3813 48.9988 107.6850 18.8488 41.5250 13.2241 53.5934 22.2594 37.4703 26.6752 55.3858 16.7563 16.1515 11.6480 28.4448 7.5386 22.9758 17.1228 29.7000 19.4499 9.7353 8.8797 17.7333 1.6303 0.8717 28.3504 30.1749 10.0438 7.5388 15.6194 49.4811 29.2075
temp: 298.150 k
press: 1.00000 atm
elementType: 8 8 8 7 6 6 6 6 6 6 6 6 6 6 6 6 6 6 6 6 6 6 6 6 6 6 6 1 1 1 1 1 1 1 1 1 1 1 1 1 1 1 1 1 1 1 1 1 1 1 1 1 1 1 1 1 1 1 1 1
symmnumber: 1
zpe: 1341130.0 jmol-1
zpe.correction: 0.510809 hartree
zpe.thermalcorrener: 0.539775 hartree
zpe.thermalcorrenthalpy: 0.540719 hartree
zpe.thermalcorrgfe: 0.449500 hartree
zpe.sumelectzpe: -1174.480448 hartree
zpe.sumelectthermal: -1174.451482 hartree
zpe.sumelectthermalent: -1174.450538 hartree
zpe.sumelectthermalfe: -1174.541757 hartree
dipole: -5.2683 -1.9063 -3.0849
dipole: 6.3957
quadrupole: -212.2004 -150.0844 -154.0519
quadrupole: -10.1641 -10.1988 4.1737
quadrupole: -40.0882 22.0278 18.0603 -10.1641 -10.1988 4.1737
hfenergy: -1174.9912574 hartree
pointgroup: C01 [X(C23H33N1O3)]
dipole: 1.8920332 0.5981579 -1.5472818 debye
polarizability: 274.1981046|22.1685638|276.6161155|-5.8143217|-31.0066351|257.7205731 unknown
InChI: InChI=1S/C23H33NO3/c1-17-9-7-10-18(2)21(17)23(22-19(3)11-8-12-20(22)4)27-16-15-26-14-13-24(5,6)25/h7-12,23H,13-16H2,1-6H3
charge 0 multiplicity 1
60 atoms
O  -0.079972 0.571456 -1.11333
O  -2.983588 -0.621709 -1.331572
O  -6.497219 -1.537179 1.296035
N  -5.235348 -1.060668 0.801696
C  1.332086 0.275308 -0.721431
C  1.391096 -0.890104 0.271755
C  2.006168 1.62662 -0.407703
C  2.45765 -1.834083 0.134886
C  2.118879 2.528374 -1.52446
C  0.394479 -1.082125 1.279916
C  2.555581 2.016431 0.858723
C  -5.361014 -0.947718 -0.730729
C  -0.635637 -0.469066 -1.989393
C  -4.345342 -0.095084 -1.494984
C  -2.064329 -0.081944 -2.349312
C  2.51171 -2.958822 0.994485
C  2.721072 3.796917 -1.354954
C  0.478136 -2.22537 2.114512
C  3.154803 3.300682 0.978951
C  -4.939883 0.293289 1.428921
C  -4.152127 -2.063238 1.180934
C  3.561499 -1.653114 -0.899305
C  1.614769 2.17312 -2.915396
C  -0.741999 -0.100211 1.527009
C  2.576299 1.160029 2.119874
C  1.521165 -3.163955 1.976619
C  3.232156 4.19388 -0.10406
H  1.824525 -0.088444 -1.651641
H  -6.373672 -0.531643 -0.866129
H  -5.366853 -1.987282 -1.096277
H  -0.631308 -1.460453 -1.490927
H  -0.019953 -0.539989 -2.914921
H  -4.64229 -0.128545 -2.567856
H  -4.374625 0.967912 -1.173021
H  -2.141563 1.025099 -2.400966
H  -2.341306 -0.506578 -3.338852
H  3.336305 -3.6738 0.888479
H  2.792025 4.471974 -2.215892
H  -0.283167 -2.368619 2.890905
H  3.568909 3.593522 1.950896
H  -5.025686 0.147112 2.515278
H  -3.937326 0.670351 1.157769
H  -5.730447 0.984875 1.100939
H  -4.50235 -3.041083 0.820335
H  -3.181551 -1.797786 0.73294
H  -4.110322 -2.081922 2.280243
H  4.035347 -0.65599 -0.835184
H  4.351878 -2.409286 -0.755555
H  3.184053 -1.767931 -1.934955
H  1.89509 2.955825 -3.640299
H  2.037471 1.21607 -3.281743
H  0.516757 2.063311 -2.918699
H  -1.161981 -0.255403 2.538022
H  -0.416522 0.9493 1.434284
H  -1.550154 -0.226499 0.78516
H  3.149331 1.678366 2.908134
H  1.565582 0.972823 2.518797
H  3.040922 0.173261 1.959744
H  1.567272 -4.039475 2.633927
H  3.696419 5.178412 0.021382
