program: Gaussian 09
title: 000215501
version: EM64L-G09RevD.01
frameworkgroup: C1[X(C16H29NO2S2)]
method: RPBEPBE
basis: SDD
operation: Freq
keyword: #p
keyword: freq=noraman
keyword: PBEPBE/SDD
title: #p freq=noraman PBEPBE/SDD
converged: NO YES NO NO
title: Mulliken charges:
elementType: S S O O N C C C C C C C C C C C C C C C C H H H H H H H H H H H H H H H H H H H H H H H H H H H H H
charge: 0.234857 0.239966 -0.290636 -0.280556 -0.616712 -0.598172 -0.351905 -0.298641 -0.372530 -0.366806 -0.392478 -0.685611 -0.401003 -0.398026 -0.383622 -0.384490 -0.385192 -0.386094 -0.391094 -0.221757 0.298094 0.206726 0.248195 0.210425 0.229421 0.218933 0.194709 0.224825 0.188669 0.296569 0.261849 0.270373 0.194887 0.197443 0.195607 0.194356 0.189265 0.203832 0.189832 0.203609 0.201580 0.187067 0.201961 0.187028 0.191840 0.191391 0.241746 0.228608 0.340298 0.341364
chargesum: 0.00000
title: Mulliken charges with hydrogens summed into heavy atoms:
elementType: S S O O N C C C C C C C C C C C C C C C C
charge: 0.234857 0.239966 -0.290636 -0.280556 0.064951 -0.598172 0.103016 0.141206 0.041112 0.046689 -0.095909 -0.153390 -0.008674 -0.008063 0.009475 0.008951 0.003454 0.002895 -0.007863 0.248596 0.298094
polarizability: 2.78524837e+02 4.63272270e+00 1.96196892e+02 -8.01702129e+00 4.33663461e+00 1.87087883e+02
1716.lowfreq: -21.4415 -12.7196 -7.4952 -0.0008 -0.0003 0.0024 5.8380 17.1438 27.5843
frequency: -10.7965 15.7200 27.2190 37.5012 56.2749 65.7568 83.4851 116.5335 137.5364 152.7855 164.4552 177.3981 187.3225 190.1603 221.6870 229.5574 246.9371 253.0812 265.4711 281.3755 292.3925 314.7840 324.7878 337.3505 347.4687 369.1499 378.1019 395.0738 433.8739 460.5009 469.1620 488.2804 499.4109 500.5917 522.6880 582.9449 611.7758 626.9045 666.0389 697.7040 704.1671 707.8919 728.5954 756.3260 764.7931 787.5815 805.0273 829.2569 831.8700 871.9268 881.5735 883.2374 927.0473 946.6904 952.9033 974.6697 977.5279 981.0723 1013.8537 1020.5389 1030.9213 1047.7930 1054.5925 1061.5533 1070.6059 1076.2748 1090.9091 1096.8869 1104.5027 1112.2765 1126.6733 1136.0346 1152.0634 1163.0952 1184.0588 1191.3710 1201.1729 1207.1624 1222.5087 1240.2127 1258.2857 1260.8403 1269.8292 1279.0421 1288.7574 1290.2471 1293.3339 1297.1107 1304.5756 1307.4670 1309.1754 1323.9935 1334.1877 1338.9691 1341.5664 1344.8471 1350.4704 1354.9799 1358.7810 1379.1017 1435.3907 1448.6226 1453.0879 1462.8416 1462.9484 1463.6304 1465.8869 1466.9731 1468.6917 1474.6706 1478.7940 1485.6363 1493.3548 1589.2809 1689.9100 2958.5029 2963.4080 2965.0913 2972.9310 2976.2246 2977.1907 2982.1265 2984.5674 2987.9495 2988.7726 2991.7823 2994.5700 3006.1568 3009.8650 3015.6179 3017.3670 3022.1328 3026.5299 3028.7887 3033.8329 3037.9222 3042.5275 3051.8088 3052.1868 3063.1695 3069.0848 3091.9033 3558.4128 3716.7595
redmass: 6.8318 4.0981 5.3473 4.5646 3.7372 3.4857 4.5245 6.2100 4.5845 3.3859 3.9539 2.8373 3.4121 3.0563 2.8045 1.8729 2.7224 1.9092 4.9198 1.8172 3.4982 2.5529 2.0637 3.3734 3.1675 2.6074 2.7361 5.6740 2.5184 3.8673 2.8412 3.3254 1.1686 2.3811 1.0746 4.1323 3.6045 5.6770 2.2058 1.4248 10.1835 5.2618 1.2605 1.7002 1.5030 2.0205 1.6075 1.7080 4.1758 2.6579 1.7991 2.1133 2.1226 2.1343 1.7830 1.8372 1.8355 1.5897 7.8717 2.0158 1.9674 3.3563 1.8827 2.1434 1.9796 2.4539 2.2352 2.6601 2.1630 2.4103 1.2260 1.7874 1.7297 1.4186 1.3080 1.1383 1.6617 1.2750 1.2271 1.3298 1.2366 1.1866 1.2189 1.3436 1.2059 1.1550 1.5297 1.3013 1.1876 1.7122 1.2009 1.1738 1.3903 1.4036 1.3935 1.3953 1.3875 1.4413 1.4407 1.6788 1.0918 1.0752 1.0806 1.0843 1.0817 1.0758 1.0840 1.0830 1.0844 1.0924 1.0885 1.0769 1.0911 1.2095 7.6293 1.0600 1.0601 1.0602 1.0617 1.0619 1.0625 1.0615 1.0611 1.0617 1.0615 1.0583 1.0621 1.0978 1.0976 1.0569 1.0990 1.0978 1.0968 1.1000 1.0987 1.1026 1.1015 1.0931 1.0996 1.1003 1.1019 1.1053 1.0446 1.1058
irintensity: 0.2024 0.0430 2.1046 3.8208 0.3415 0.3018 2.3429 1.9670 7.8597 0.6192 1.8849 2.0226 3.1447 1.0188 4.3121 0.0346 2.6555 0.3289 1.2764 0.3793 0.3252 0.1102 0.4614 0.7045 1.7375 1.4916 7.6607 1.7793 0.4314 11.9608 4.3814 1.8613 254.2815 1.8898 66.1728 3.3744 10.2137 5.8373 5.1904 10.7464 28.3741 5.2511 31.8278 12.7948 0.7755 1.9841 0.4387 7.3130 45.4586 0.2796 2.2444 10.3489 4.2380 0.6005 0.6324 0.8031 0.3419 4.6815 147.3610 0.5201 2.5556 42.5219 13.5774 13.4867 3.0142 2.3214 0.6762 28.6535 0.8622 0.2175 2.0041 4.3623 1.4098 11.2553 2.1142 0.1933 0.7343 8.8513 5.4127 18.9457 11.0821 1.2161 66.3262 1.0986 6.8671 11.0635 193.5298 10.8706 4.7677 250.2165 13.9994 0.3558 0.6660 2.9135 2.7589 0.4561 0.6558 0.4679 0.8923 53.3799 4.0978 9.3966 2.3244 10.7848 7.2111 14.6419 4.3229 5.4878 6.0879 2.6473 2.8359 2.4619 49.9940 117.9859 364.6264 39.7713 43.0355 25.8152 33.0237 24.0905 44.2494 19.1708 14.4059 2.4978 7.7687 15.0930 27.4665 22.7798 6.3384 31.9328 9.8792 0.2352 94.0123 14.8623 58.0836 117.4047 188.9314 10.9504 53.8992 31.0234 17.5905 20.3739 65.2068 53.8527
temp: 298.150 k
press: 1.00000 atm
elementType: 16 16 8 8 7 6 6 6 6 6 6 6 6 6 6 6 6 6 6 6 6 1 1 1 1 1 1 1 1 1 1 1 1 1 1 1 1 1 1 1 1 1 1 1 1 1 1 1 1 1
symmnumber: 1
zpe: 1132617.9 jmol-1
zpe.correction: 0.431391 hartree
zpe.thermalcorrener: 0.453957 hartree
zpe.thermalcorrenthalpy: 0.454901 hartree
zpe.thermalcorrgfe: 0.378829 hartree
zpe.sumelectzpe: -1626.748427 hartree
zpe.sumelectthermal: -1626.725861 hartree
zpe.sumelectthermalent: -1626.724917 hartree
zpe.sumelectthermalfe: -1626.800989 hartree
dipole: -0.8521 -0.0678 1.6820
dipole: 1.8867
quadrupole: -141.3583 -146.4332 -137.2446
quadrupole: -4.9702 13.8587 3.6282
quadrupole: 0.3204 -4.7545 4.4341 -4.9702 13.8587 3.6282
hfenergy: -1627.1798182 hartree
pointgroup: C01 [X(C16H29N1O2S2)]
dipole: 0.3266438 0.1647601 0.6458789 debye
polarizability: 277.8662132|9.365831|194.8564212|7.5424664|-5.4086037|189.0869779 unknown
InChI: InChI=1S/C16H29NO2S2/c17-15(18)19-12-14-13-20-16(21-14)10-8-6-4-2-1-3-5-7-9-11-16/h14H,1-13,17H2
charge 0 multiplicity 1
50 atoms
S  -1.48439 0.17273 0.572349
S  -0.498564 1.941638 -1.761362
O  -4.599529 -0.094256 0.665643
O  -6.253003 -1.550877 -0.177419
N  -6.170599 -0.917208 2.086197
C  0.101675 0.728484 -0.397941
C  1.012764 1.518831 0.573172
C  0.764205 -0.508699 -1.051594
C  2.249522 2.184503 -0.090175
C  1.163496 -1.641766 -0.068792
C  -2.798487 0.892925 -0.610027
C  -2.152558 1.08193 -1.989958
C  3.37723 2.524842 0.92191
C  2.217905 -2.616164 -0.660675
C  4.164824 1.284143 1.423456
C  3.648007 -2.017599 -0.75222
C  5.085832 0.654572 0.345848
C  4.340263 -1.836281 0.624679
C  5.508097 -0.812478 0.629872
C  -4.00049 -0.047876 -0.687797
C  -5.736937 -0.922815 0.779566
H  1.344515 0.823501 1.368446
H  0.39887 2.290469 1.071574
H  1.658105 -0.156051 -1.601888
H  0.076464 -0.920156 -1.814827
H  1.922269 3.109226 -0.604455
H  2.663107 1.526977 -0.877634
H  0.252091 -2.199581 0.218008
H  1.564394 -1.210847 0.868442
H  -3.10475 1.867378 -0.194052
H  -1.997087 0.11505 -2.49917
H  -2.760218 1.741578 -2.634193
H  4.087713 3.231722 0.446628
H  2.936498 3.05988 1.787804
H  2.252226 -3.532518 -0.036452
H  1.886546 -2.938356 -1.669148
H  3.444405 0.52761 1.790813
H  4.777964 1.567556 2.302464
H  3.594221 -1.043287 -1.276006
H  4.279459 -2.667481 -1.390894
H  5.997151 1.278389 0.245742
H  4.585317 0.69971 -0.64103
H  4.721326 -2.819686 0.966741
H  3.590573 -1.528735 1.379471
H  6.26074 -1.12025 -0.125266
H  6.01798 -0.856808 1.614534
H  -3.703211 -1.067313 -0.993743
H  -4.755917 0.333004 -1.402313
H  -5.667888 -0.386721 2.793556
H  -6.988326 -1.467841 2.330815
