program: Gaussian 09
title: 000215461
version: EM64L-G09RevD.01
frameworkgroup: C1[X(C8H11N5O2)]
method: RPBEPBE
basis: SDD
operation: Freq
keyword: #p
keyword: freq=noraman
keyword: PBEPBE/SDD
title: #p freq=noraman PBEPBE/SDD
converged: NO YES NO NO
title: Mulliken charges:
elementType: O O N N N N N C C C C C C C C H H H H H H H H H H H
charge: -0.268064 -0.267099 -0.164556 -0.218480 -0.402277 -0.089323 -0.504557 0.124035 0.090345 0.131193 0.146030 0.207425 -0.490824 -0.614869 -0.598463 0.336517 0.240220 0.241029 0.273660 0.245390 0.245269 0.268087 0.250910 0.250922 0.283401 0.284081
chargesum: 0.00000
title: Mulliken charges with hydrogens summed into heavy atoms:
elementType: O O N N N N N C C C C C C C C
charge: -0.268064 -0.267099 -0.164556 -0.218480 -0.065760 -0.089323 0.062925 0.124035 0.090345 0.131193 0.146030 0.207425 -0.009575 0.149450 0.171455
polarizability: 1.77352869e+02 5.00769208e-01 1.41408822e+02 -8.11578977e-02 5.15646730e-02 6.84888564e+01
1716.lowfreq: -21.9244 -5.2186 0.0002 0.0006 0.0009 2.5449 11.2329 72.3748 81.0904
frequency: -20.1400 72.3703 81.0888 112.3637 118.5630 125.9641 129.9012 180.1083 200.1298 252.7898 261.0100 291.2006 315.1981 343.6773 362.5868 385.2633 401.9682 460.5101 482.6809 541.6884 625.7183 635.7897 657.7765 687.2299 702.9837 704.8190 744.6591 763.1441 774.1717 890.8421 927.9665 961.4786 978.8107 1040.4699 1102.5866 1128.8281 1129.8225 1131.7117 1160.1151 1179.8898 1199.0193 1227.6421 1261.8567 1278.1589 1314.3804 1339.3242 1367.8627 1389.2106 1416.3478 1428.9489 1440.5401 1462.2319 1474.7357 1478.5028 1478.9902 1480.3850 1522.9911 1578.7692 1616.0767 1657.9322 1663.7674 2977.4813 3006.9827 3012.0469 3024.9671 3096.2276 3104.4463 3137.7785 3138.7010 3449.7544 3564.2642 3583.8798
redmass: 2.0301 3.1920 1.0719 3.9061 4.5391 4.4119 1.1043 3.3992 3.1167 4.3703 1.7421 2.9192 3.9457 3.6955 6.3510 8.1627 7.3546 5.4698 7.6539 5.3137 5.5800 4.5494 1.9984 1.9626 2.3741 10.8974 11.2819 3.7563 3.8395 1.4127 4.3537 3.7256 6.1893 3.1384 4.3026 3.4038 1.3007 1.3016 1.2089 2.2290 2.4272 2.7819 4.8643 3.9401 2.4141 1.1998 4.3399 2.6414 1.3712 1.3827 1.6249 1.5624 1.0431 1.0852 1.0673 1.1806 3.6808 8.2304 10.5345 10.2588 1.0826 1.0601 1.0336 1.0327 1.1017 1.1026 1.1022 1.1025 1.1011 1.0460 1.0955 1.0818
irintensity: 0.9387 0.3819 0.0690 0.3712 5.5007 1.0510 1.1053 31.9492 1.7950 29.8745 47.3998 1.7759 11.0777 10.4363 0.0189 21.1177 1.6525 26.4523 23.2196 5.7575 0.3978 17.4048 45.5175 69.3841 188.6392 7.2021 10.0227 93.8189 131.3635 1.7723 4.6052 9.7724 26.6434 44.6043 24.4353 8.3909 0.3487 0.0680 0.0364 7.1171 75.3578 5.4542 21.4255 12.0000 117.7539 0.1490 10.7754 16.6950 13.3620 83.4146 152.4320 63.8824 18.9869 8.1184 23.1995 49.2785 79.2347 11.4312 549.0673 430.2857 24.0772 28.8571 36.0839 26.3202 15.6156 18.6929 17.3204 0.7369 0.3645 4.2185 2.9527 75.8519
temp: 298.150 k
press: 1.00000 atm
elementType: 8 8 7 7 7 7 7 6 6 6 6 6 6 6 6 1 1 1 1 1 1 1 1 1 1 1
symmnumber: 1
zpe: 527685.2 jmol-1
zpe.correction: 0.200985 hartree
zpe.thermalcorrener: 0.214663 hartree
zpe.thermalcorrenthalpy: 0.215607 hartree
zpe.thermalcorrgfe: 0.160818 hartree
zpe.sumelectzpe: -734.583181 hartree
zpe.sumelectthermal: -734.569503 hartree
zpe.sumelectthermalent: -734.568559 hartree
zpe.sumelectthermalfe: -734.623347 hartree
dipole: 2.9578 -0.0628 0.0024
dipole: 2.9584
quadrupole: -97.6572 -89.8379 -85.2064
quadrupole: -1.4840 0.0208 -0.0019
quadrupole: -6.7567 1.0626 5.6941 -1.4840 0.0208 -0.0019
hfenergy: -734.7841652 hartree
pointgroup: C01 [X(C8H11N5O2)]
dipole: 1.16228 -0.0605993 -0.0131447 debye
dipolederiv: -0.6148879 0.117136 0.0221833 0.1864174 -1.3264905 -0.1831365 0.035336 -0.1834352 -0.3987685 -1.1814794 -0.3833148 -0.0722349 -0.4449126 -0.7574704 -0.0736204 -0.087704 -0.0750796 -0.3822977 -1.1533886 -0.4118357 -0.0789901 0.1383761 -0.7366924 -0.1100613 0.025427 -0.1079099 -0.1807691 -0.834902 -0.2468458 -0.0476915 -0.3766463 -1.1335517 -0.1759837 -0.0721341 -0.1751037 -0.2441514 -0.3620332 -0.1011426 -0.0185561 -0.0611463 -0.5509745 -0.0659967 -0.0111687 -0.0669771 -0.2164093 -0.8642581 -0.2174896 -0.0411877 -0.1806569 -0.3903199 -0.0292125 -0.0344578 -0.0289748 -0.2430102 -1.0147341 0.1489864 0.0307725 0.1476887 -0.3902172 -0.0379196 0.0293804 -0.0372534 -0.2146254 -0.5069155 0.6371656 0.1215276 0.4847755 -0.440584 -0.075339 0.0911545 -0.074385 -0.060252 0.9174264 0.5351327 0.1013827 0.1666021 0.5799015 0.0928449 0.0306009 0.0924154 0.1112376 1.4188813 -0.1305922 -0.0238563 -0.0488583 1.6698892 0.2726872 -0.0087456 0.2732231 0.2920241 0.3389194 0.0728283 0.0144494 0.270618 0.4754908 0.090985 0.0568361 0.0908826 0.0127802 1.709202 0.3011038 0.057521 0.2507904 1.2463702 0.1866212 0.0505871 0.1877908 0.2963822 0.5294217 -0.0768178 -0.0161795 -0.3401594 0.3864675 0.0355982 -0.0726192 0.0353034 0.2240883 0.0181681 -0.0337535 -0.0064954 -0.095786 0.5133479 0.0602725 -0.0167588 0.0599772 0.2187319 0.3552376 -0.1104404 -0.0207278 -0.1866484 0.1030299 -0.0183125 -0.0349184 -0.0181433 0.1949465 0.2304935 0.0313583 0.0060434 -0.0036823 0.2413741 -0.0182519 -0.000291 -0.0182119 0.3340872 -0.0457694 0.013913 0.0257918 0.000817 -0.0460989 0.0899799 0.0558973 0.1229233 0.0151404 -0.0493034 0.0222209 -0.0190946 0.023733 0.0405902 -0.0786699 -0.0502613 -0.1119292 -0.0708038 0.024808 -0.1370146 -0.0232762 -0.0100205 0.1191356 -0.0024099 -0.000311 -0.00252 0.131182 0.0671651 0.1135332 -0.0763626 0.0486527 -0.0007595 0.0129602 -0.0747584 0.0717627 -0.0286534 0.0705458 0.076561 0.1096425 0.0185649 0.021844 0.0068437 0.0851771 -0.0540995 -0.0599323 0.1757915 -0.0674918 -0.012661 0.0735908 -0.01382 -0.0263398 0.0141412 -0.0266752 0.1220787 -0.0107902 0.0131959 0.0539651 -0.0509844 0.0770743 0.099013 0.0758919 0.0510311 -0.0155497 -0.0101185 0.0319898 -0.0452103 -0.0197311 0.1156202 -0.0477246 -0.0890593 0.000321 -0.054551 0.395367 -0.0695785 -0.1631389 0.0285009 0.1153616 -0.0555196 -0.1146417 -0.0299556 0.090639 0.3971527 -0.1288073 0.1223836 -0.0198949 0.0814821 0.050692 0.1173997 0.025023 0.1264557 unknown
polarizability: 177.0793667|-3.1124428|139.1019544|-0.5675019|13.4986868|71.0692261 unknown
InChI: InChI=1S/C8H11N5O2/c1-12-6-5(10-4(3-9)11-6)7(14)13(2)8(12)15/h10H,3,9H2,1-2H3
charge 0 multiplicity 1
26 atoms
O  -1.242656 2.816543 0.509703
O  -3.140837 -1.432778 -0.301151
N  -0.798221 -1.28859 -0.269734
N  -2.176918 0.667339 0.09889
N  1.496362 1.371993 0.237186
N  1.647866 -0.855828 -0.188457
N  4.575156 -0.862952 -0.207964
C  0.18258 0.898372 0.146555
C  0.311258 -0.472247 -0.114386
C  -1.076667 1.57976 0.273975
C  2.347271 0.292963 0.030617
C  -2.0978 -0.731795 -0.16451
C  3.866632 0.394111 0.050317
C  -0.640796 -2.730065 -0.543366
C  -3.549005 1.216262 0.199788
H  1.749695 2.342496 0.422457
H  4.188419 1.144196 -0.699086
H  4.189639 0.788692 1.03405
H  -1.647707 -3.16649 -0.612203
H  -0.071984 -3.209488 0.270812
H  -0.096161 -2.879309 -1.490838
H  -3.455492 2.293138 0.402789
H  -4.098319 0.714469 1.012978
H  -4.095074 1.04512 -0.742196
H  4.37872 -1.239274 -1.14247
H  4.376838 -1.577935 0.501248
