program: Gaussian 09
title: 000215434
version: EM64L-G09RevD.01
frameworkgroup: C1[X(C18H22N2O5)]
method: RPBEPBE
basis: SDD
operation: Freq
keyword: #p
keyword: freq=noraman
keyword: PBEPBE/SDD
title: #p freq=noraman PBEPBE/SDD
converged: YES YES NO NO
title: Mulliken charges:
elementType: O O O O O N N C C C C C C C C C C C C C C C C C C H H H H H H H H H H H H H H H H H H H H H H
charge: -0.292849 -0.298075 -0.263131 -0.256648 -0.438309 -0.082120 -0.137077 -0.363378 -0.360665 -0.392839 -0.393268 -0.343568 0.147961 0.037784 0.210261 0.176989 -0.323071 0.259686 -0.567030 -0.535850 0.245895 0.254160 -0.802353 -0.318645 -0.314918 0.208188 0.206076 0.187717 0.219304 0.226890 0.258001 0.258490 0.221135 0.172352 0.225199 0.234302 0.189112 0.267386 0.274839 0.291011 0.223241 0.233575 0.229316 0.231420 0.229623 0.232030 0.331849
chargesum: 0.00000
title: Mulliken charges with hydrogens summed into heavy atoms:
elementType: O O O O O N N C C C C C C C C C C C C C C C C C C
charge: -0.292849 -0.298075 -0.263131 -0.256648 -0.106461 -0.082120 -0.137077 0.050886 0.046356 0.092051 0.086357 0.053983 0.147961 0.037784 0.210261 0.176989 0.100344 0.259686 -0.299644 -0.261011 0.245895 0.254160 -0.054526 0.142091 0.146735
polarizability: 3.80856808e+02 -2.60399088e+01 2.17531554e+02 1.84016726e+01 1.60861400e+01 1.50479511e+02
1716.lowfreq: -9.0865 -3.1941 -0.0012 -0.0008 0.0003 2.3933 17.2915 24.0230 33.1079
frequency: 17.1663 23.9065 33.0266 61.2592 65.0342 66.2621 80.3080 89.1138 98.8444 102.9335 125.0266 160.2491 194.6515 206.1493 222.5912 234.1995 238.1579 284.1583 295.1589 311.1656 318.7424 321.2121 336.2899 359.8581 373.9449 385.1730 394.2347 416.0443 436.1949 445.3647 465.5688 475.0945 500.1161 507.9996 556.9664 586.5693 602.1245 630.1742 653.4503 676.2198 690.7194 709.9886 721.4217 729.4912 757.6986 766.6249 797.7978 801.6047 836.5493 852.6812 869.0702 875.7820 885.6171 892.7579 941.9774 963.2194 986.9277 996.3734 1014.2692 1031.1883 1041.6635 1045.8104 1047.6616 1053.2591 1055.1808 1066.7810 1080.6617 1088.1951 1112.2521 1125.4362 1136.5955 1142.3586 1150.9632 1166.3670 1197.4666 1200.9518 1219.5953 1223.0536 1231.1774 1249.2772 1266.6663 1278.1692 1291.9248 1294.9732 1307.2729 1334.2197 1336.2169 1340.0294 1349.9117 1351.5432 1357.3870 1362.9143 1369.4653 1392.2842 1394.4559 1400.4949 1423.9656 1442.4565 1445.9975 1451.5068 1454.5737 1456.0850 1462.0820 1462.8365 1465.3123 1472.0318 1475.3321 1480.4458 1484.3750 1530.8044 1588.4068 1591.8160 1637.7918 2831.4429 2852.6397 2865.2670 2964.6323 2976.5105 2993.5820 2996.3117 2996.8591 3006.3728 3034.3484 3040.8879 3046.3552 3047.5360 3098.7599 3100.7754 3103.0451 3103.3454 3121.0674 3131.2526 3168.2162 3186.2955 3558.2018
redmass: 5.4569 3.9811 4.5671 2.9575 3.2041 4.9626 2.9579 1.5437 3.6608 2.3256 5.2669 4.0057 3.6274 4.1387 3.1694 4.4545 2.8179 3.7696 2.2953 1.8648 2.5031 3.7345 2.0262 3.2860 5.1291 6.7763 5.9462 2.2174 3.0963 5.9948 4.1278 3.4802 3.8930 7.9656 4.2951 4.0049 4.2415 2.8187 3.7851 7.3849 3.5892 6.5030 6.3920 4.9258 7.4923 3.7371 1.6904 2.0330 1.5627 1.4694 3.3818 1.4852 3.3384 2.6002 2.5838 3.5419 2.7368 2.6151 2.6375 2.9877 1.7744 1.5405 1.9200 4.7107 2.3554 2.4227 2.4109 1.9583 2.7427 2.1565 3.0142 3.5387 2.5580 2.0460 1.0879 1.1560 1.6819 1.8959 2.1751 1.2577 1.4948 1.9327 1.3484 1.4535 1.3732 2.2625 1.3878 1.2479 1.3264 1.3166 1.5077 1.5071 1.4577 2.2666 1.5666 1.4493 2.6282 2.3900 1.3229 1.2648 1.0801 1.1248 1.3386 1.1009 1.1249 1.1052 2.3235 1.0882 1.2046 5.6516 9.7117 7.5072 8.4304 1.0707 1.0711 1.0696 1.0699 1.0392 1.0660 1.0686 1.0679 1.0613 1.0892 1.0868 1.0891 1.0971 1.0972 1.0986 1.1041 1.0961 1.0970 1.0935 1.0925 1.0934 1.0661
irintensity: 0.0272 0.4079 2.3479 7.4271 0.1397 2.8376 2.7621 5.2227 1.0234 0.7181 6.4771 0.6396 0.1126 1.0012 0.6132 4.2697 5.0306 5.8200 41.9567 44.9954 41.9631 3.1190 48.1186 29.2985 19.6008 8.0174 8.8957 1.2843 5.1830 0.0966 0.4038 0.5813 2.5860 14.7349 0.5168 0.2562 10.8037 6.5399 4.0016 2.3517 3.3592 7.5092 5.7073 3.1945 26.4575 12.7089 1.8536 1.9275 0.8949 12.6625 5.4456 45.2260 31.9823 57.5443 1.6056 139.5602 6.0908 149.3512 31.0900 54.9393 4.5824 2.9102 3.7600 13.5687 33.6903 17.5831 34.5550 0.2201 112.5004 8.0828 57.9133 86.6105 15.4360 7.9678 8.8633 1.9775 76.9284 5.8645 210.0879 100.0399 64.8928 32.7356 36.5351 39.7358 19.8356 230.6444 14.9077 35.3672 14.0087 19.5509 9.1748 3.6408 26.9253 176.6425 40.0978 70.2896 109.8315 9.2182 66.0314 6.5997 0.7088 8.0302 28.4154 8.4560 13.3648 6.4331 8.9648 8.0335 27.2133 201.3117 106.6487 83.0536 26.2847 85.7496 56.4082 127.3283 54.8983 30.3273 14.7712 71.4101 66.0770 50.7342 17.1669 45.1532 62.5032 18.4392 5.3502 41.1930 17.3803 27.0350 1.2210 5.0353 1.6727 0.8150 9.4514
temp: 298.150 k
press: 1.00000 atm
elementType: 8 8 8 8 8 7 7 6 6 6 6 6 6 6 6 6 6 6 6 6 6 6 6 6 6 1 1 1 1 1 1 1 1 1 1 1 1 1 1 1 1 1 1 1 1 1 1
symmnumber: 1
zpe: 993406.7 jmol-1
zpe.correction: 0.378369 hartree
zpe.thermalcorrener: 0.401768 hartree
zpe.thermalcorrenthalpy: 0.402713 hartree
zpe.thermalcorrgfe: 0.323526 hartree
zpe.sumelectzpe: -1182.824986 hartree
zpe.sumelectthermal: -1182.801586 hartree
zpe.sumelectthermalent: -1182.800642 hartree
zpe.sumelectthermalfe: -1182.879829 hartree
dipole: 3.7148 -1.7111 1.9195
dipole: 4.5180
quadrupole: -123.5310 -156.4955 -146.0506
quadrupole: -20.5097 -3.3835 2.5790
quadrupole: 18.4947 -14.4698 -4.0249 -20.5097 -3.3835 2.5790
hfenergy: -1183.2033542 hartree
pointgroup: C01[X(C18H22N2O5)]
dipole: -1.4530622 0.6679397 0.775899 debye
polarizability: 380.2820055|-26.9489957|218.6020857|-20.0729264|-14.3551596|149.983782 unknown
InChI: InChI=1S/C18H22N2O5/c1-12-13-10-15-16(24-9-8-23-15)11-14(13)25-17(12)18(22)20-4-2-19(3-5-20)6-7-21/h10-11,21H,2-9H2,1H3
charge 0 multiplicity 1
47 atoms
O  -0.519386 0.180043 -0.779342
O  1.564714 -2.798617 -0.594449
O  -5.828847 -0.10676 0.921126
O  -4.932823 2.290347 -0.49449
O  8.265484 1.740921 0.994805
N  4.731046 0.719652 0.033657
N  2.317294 -0.604474 -0.835004
C  4.725157 -0.741271 -0.234666
C  3.401513 1.163622 0.518596
C  3.644001 -1.090515 -1.27513
C  2.303956 0.840694 -0.519675
C  5.848933 1.15184 0.902617
C  1.3209 -1.539888 -0.568769
C  -0.063026 -1.090865 -0.27388
C  -1.096797 -1.768688 0.367758
C  -2.265562 -0.903716 0.293149
C  7.173383 1.283068 0.121045
C  -1.87516 0.266586 -0.417768
C  -3.603466 -1.018804 0.74088
C  -2.733424 1.335587 -0.696082
C  -4.49228 0.034458 0.469912
C  -4.058684 1.211716 -0.231731
C  -1.055268 -3.121493 1.021668
C  -6.765981 0.830069 0.26688
C  -6.185474 2.2451 0.292028
H  5.710894 -1.045678 -0.629317
H  4.534928 -1.327913 0.699993
H  3.129068 0.678991 1.491489
H  3.42876 2.257273 0.678627
H  3.894822 -0.602614 -2.236951
H  3.576784 -2.181002 -1.414522
H  1.318411 1.139075 -0.139379
H  2.506326 1.411754 -1.446711
H  5.996833 0.457323 1.772009
H  5.609677 2.144765 1.325429
H  7.077488 2.063145 -0.649395
H  7.441855 0.328448 -0.378209
H  -3.969943 -1.899638 1.275331
H  -2.419199 2.232421 -1.234058
H  -0.051783 -3.564144 0.943481
H  -1.34975 -3.051629 2.086263
H  -1.76841 -3.810297 0.52969
H  -7.700717 0.763823 0.845949
H  -6.945584 0.503946 -0.776206
H  -6.858276 2.973099 -0.188554
H  -5.973243 2.557688 1.332669
H  8.417157 1.063848 1.70223
