program: Gaussian 09
title: 000215413
version: EM64L-G09RevD.01
frameworkgroup: C1[X(C18H23N3O)]
method: RPBEPBE
basis: SDD
operation: Freq
keyword: #p
keyword: freq=noraman
keyword: PBEPBE/SDD
title: #p freq=noraman PBEPBE/SDD
converged: NO YES NO NO
title: Mulliken charges:
elementType: O N N N C C C C C C C C C C C C C C C C C C H H H H H H H H H H H H H H H H H H H H H H H
charge: -0.252934 -0.076502 -0.458548 -0.436353 -0.358571 -0.384246 -0.573324 -0.354432 0.252943 -0.465406 0.472414 0.125628 -0.473756 0.135845 0.215748 -0.423920 -0.804289 -0.364441 -0.259746 -0.222573 0.189277 -0.801678 0.179102 0.235612 0.184437 0.220132 0.207615 0.228539 0.230156 0.179771 0.252540 0.245682 0.201073 0.297639 0.237555 0.243579 0.239317 0.233061 0.304739 0.225105 0.218310 0.218597 0.267249 0.239023 0.230030
chargesum: 0.00000
title: Mulliken charges with hydrogens summed into heavy atoms:
elementType: O N N N C C C C C C C C C C C C C C C C C C
charge: -0.252934 -0.076502 -0.160909 -0.131614 0.056143 0.020323 -0.137170 0.055494 0.252943 0.032817 0.472414 0.125628 -0.272683 0.135845 0.215748 -0.186365 -0.088332 -0.139335 -0.041436 -0.003976 0.189277 -0.065376
polarizability: 2.95109672e+02 4.06537636e+00 2.49029675e+02 1.35120787e+01 -2.04285593e+00 1.31416150e+02
1716.lowfreq: -83.9011 -6.1758 -0.0003 0.0008 0.0010 1.8353 6.0122 12.8616 15.3934
frequency: -83.8695 7.4090 15.3720 30.6823 33.9807 55.7187 83.0156 94.9843 112.1546 124.9385 139.0119 154.8171 179.3977 220.3949 239.4567 259.7297 264.3967 284.0480 296.7242 325.6129 349.5157 361.7132 412.0354 432.5277 457.1825 475.4504 484.3407 490.9378 509.1997 533.2247 573.0176 577.5732 582.7781 616.4307 650.6600 654.9025 656.3268 714.9364 736.9314 748.2237 760.3595 767.0265 794.3257 801.0728 812.6432 848.9921 850.6509 899.2034 915.4341 928.6980 951.8803 968.0542 973.1294 974.2988 981.4679 991.2598 1010.2498 1027.6811 1039.8490 1046.2363 1048.5749 1068.4461 1079.3369 1109.2042 1131.7127 1147.7119 1167.6984 1170.0516 1181.6858 1197.3383 1207.4278 1231.1259 1235.2716 1243.0817 1253.3619 1262.8198 1291.5155 1303.2767 1306.2044 1316.0290 1332.8793 1342.5189 1363.2070 1372.4451 1382.0997 1396.7720 1397.8411 1414.4956 1428.7202 1443.1275 1447.5209 1460.3808 1466.1393 1467.0885 1467.9432 1468.8287 1471.5414 1478.3656 1481.9863 1487.3805 1497.3635 1581.0054 1599.1238 1632.3779 1633.7627 1686.6785 2771.3290 2827.2029 2848.2954 2965.6607 2981.4635 2986.3098 2989.2596 3010.3265 3023.3486 3033.6589 3038.7722 3046.5212 3072.0655 3078.0329 3093.5433 3097.1956 3120.0774 3126.9657 3132.6321 3141.3792 3160.3567 3506.3949 3604.7892
redmass: 1.0491 5.8752 4.7003 3.3733 4.3109 3.9086 3.5218 1.0784 4.1221 3.2000 3.7153 3.0948 3.6569 2.0078 2.8778 2.7219 3.1725 3.4143 3.8626 3.2483 2.8921 3.7877 3.8392 2.9257 2.2826 3.8584 5.2240 1.2173 3.0304 3.5963 3.0712 3.5858 4.5596 4.2919 4.6151 2.0572 1.6944 4.3073 2.9262 1.3941 3.8505 2.0851 1.9893 1.5318 1.9044 3.0403 1.6280 3.4973 4.7581 1.3839 2.6236 1.2971 1.9341 1.6533 1.8938 1.7931 2.0945 1.6545 1.7958 2.2390 2.1218 2.3214 2.1870 1.8266 2.2897 1.9323 1.6434 1.3222 1.9053 1.4099 1.5640 1.4790 1.4719 1.8866 1.6655 1.3786 1.2204 1.7997 2.4563 1.4749 1.3235 1.8495 1.4692 1.2326 2.3080 1.6194 1.6106 2.7139 2.7140 1.1334 1.0954 1.1386 1.0853 2.1125 1.0621 1.0491 1.4751 1.3065 1.9185 1.1566 1.6326 6.5771 6.5580 5.5602 6.6695 6.1221 1.0718 1.0709 1.0711 1.0392 1.0653 1.0380 1.0769 1.0658 1.0893 1.0980 1.0883 1.0985 1.0984 1.0965 1.0950 1.0907 1.0848 1.0891 1.0980 1.0950 1.1000 1.0758 1.0803
irintensity: 0.0206 8.3688 0.1849 2.1113 0.5396 0.7412 0.8660 0.0666 0.4621 2.7078 3.0843 2.8384 3.5561 5.0363 0.6284 0.7240 0.8003 0.6778 0.5355 2.4868 5.0086 3.4851 4.3157 6.3854 8.0093 4.3852 0.2662 82.9863 8.2186 6.6659 0.1927 8.5819 15.2740 10.2812 1.2031 8.9577 36.1918 3.0336 4.6358 93.4442 9.4415 0.2153 2.8857 52.9124 17.9861 0.1342 0.0382 0.0467 15.5268 2.8192 14.0578 0.0110 3.9240 12.9581 15.9779 0.3363 12.0955 7.7922 5.2590 2.5579 13.1221 4.3395 0.2909 2.7854 83.7784 8.8277 4.2314 3.2903 3.3134 9.8070 14.9310 27.7776 5.4092 13.7677 68.3172 13.1596 4.9278 29.6117 37.4148 35.9426 5.4749 37.1365 55.3909 41.3871 111.6123 28.3891 32.9989 27.8383 19.9335 9.1289 75.1018 10.7527 7.6096 19.9436 10.6928 19.4039 16.0411 3.8656 6.8197 22.7028 181.3890 2.8637 7.6476 203.5641 2.4774 61.2928 92.3548 56.1832 160.0078 63.3885 22.2932 10.8797 47.3880 6.8618 4.8548 22.4601 22.0329 54.7649 17.1040 10.1180 20.0414 37.9625 3.2709 4.1189 8.2094 40.3414 32.4083 6.7227 47.5029
temp: 298.150 k
press: 1.00000 atm
elementType: 8 7 7 7 6 6 6 6 6 6 6 6 6 6 6 6 6 6 6 6 6 6 1 1 1 1 1 1 1 1 1 1 1 1 1 1 1 1 1 1 1 1 1 1 1
symmnumber: 1
zpe: 987465.3 jmol-1
zpe.correction: 0.376106 hartree
zpe.thermalcorrener: 0.396992 hartree
zpe.thermalcorrenthalpy: 0.397936 hartree
zpe.thermalcorrgfe: 0.322523 hartree
zpe.sumelectzpe: -937.572840 hartree
zpe.sumelectthermal: -937.551954 hartree
zpe.sumelectthermalent: -937.551009 hartree
zpe.sumelectthermalfe: -937.626422 hartree
dipole: 0.5918 5.8220 -0.3189
dipole: 5.8607
quadrupole: -107.8951 -125.0963 -134.9145
quadrupole: -8.2311 16.0007 1.3734
quadrupole: 14.7402 -2.4610 -12.2792 -8.2311 16.0007 1.3734
hfenergy: -937.9489458 hartree
pointgroup: C01 [X(C18H23N3O1)]
dipole: -0.1365245 -2.2920141 -0.2110691 debye
polarizability: 294.3789699|6.5983779|249.1828466|-15.0517964|5.8593865|131.9936813 unknown
InChI: InChI=1S/C18H23N3O/c1-13-16(17-5-3-4-6-18(17)19-13)9-12-21-10-7-15(8-11-21)20-14(2)22/h3-7,19-20H,8-12H2,1-2H3
charge 0 multiplicity 1
45 atoms
O  6.073462 2.007744 0.535665
N  1.236128 -0.224662 0.133512
N  -4.647555 -1.455019 0.317899
N  5.475083 -0.084415 -0.372225
C  -0.176714 -0.446379 0.518306
C  2.020276 0.447724 1.197646
C  -1.074981 -0.86089 -0.679307
C  1.90484 -1.465518 -0.318748
C  -2.541666 -0.839003 -0.324462
C  3.380776 0.932308 0.663333
C  4.078109 -0.185002 -0.089376
C  -3.375234 0.351136 -0.244979
C  3.396022 -1.293162 -0.500772
C  -3.349823 -1.927179 0.027072
C  -4.692371 -0.065582 0.159891
C  -3.135843 1.730061 -0.485775
C  -3.031502 -3.392372 0.127043
C  -5.756611 0.845785 0.328936
C  -4.193463 2.64661 -0.318755
C  -5.489581 2.209922 0.085521
C  6.377276 0.941758 -0.076101
C  7.798943 0.662695 -0.575333
H  -0.275139 -1.219257 1.32642
H  -0.567054 0.50166 0.932705
H  2.187973 -0.228938 2.075908
H  1.440637 1.316482 1.559088
H  -0.784892 -1.867003 -1.036857
H  -0.86838 -0.157106 -1.508821
H  1.461356 -1.778905 -1.284484
H  1.713892 -2.312326 0.400401
H  4.0129 1.289661 1.49328
H  3.241037 1.799942 -0.007609
H  3.918298 -2.109592 -1.020399
H  -5.430684 -2.044634 0.591302
H  -2.144986 2.077352 -0.801092
H  -2.001069 -3.584187 -0.213648
H  -3.11087 -3.763738 1.167574
H  -3.709791 -4.005688 -0.497777
H  5.864693 -0.879198 -0.88738
H  -6.755379 0.515185 0.636595
H  -4.022689 3.713421 -0.502051
H  -6.291816 2.946421 0.20781
H  8.459547 1.463583 -0.21296
H  7.835757 0.650654 -1.680659
H  8.18009 -0.307948 -0.207335
