program: Gaussian 09
title: 000215401
version: EM64L-G09RevD.01
frameworkgroup: C1[X(C23H27N3O2)]
method: RPBEPBE
basis: SDD
operation: Freq
keyword: #p
keyword: freq=noraman
keyword: PBEPBE/SDD
title: #p freq=noraman PBEPBE/SDD
converged: YES YES NO NO
title: Mulliken charges:
elementType: O O N N N C C C C C C C C C C C C C C C C C C C C C C C H H H H H H H H H H H H H H H H H H H H H H H H H H H
charge: -0.286658 -0.271403 -0.058570 -0.414081 -0.401401 -0.054185 -0.433512 -0.460525 -0.373810 -0.390827 -0.347344 -0.573909 0.400997 0.134609 0.164250 -0.448989 0.210225 -0.572747 0.259173 -0.322135 0.306366 -0.347508 -0.353539 -0.358820 -0.224195 -0.238433 -0.228125 -0.536647 0.269056 0.211642 0.240832 0.210346 0.218071 0.180484 0.213162 0.225979 0.150414 0.216434 0.198843 0.224727 0.211274 0.300345 0.268662 0.302332 0.246181 0.227840 0.247153 0.275209 0.214546 0.231576 0.228600 0.231831 0.218292 0.215847 0.242066
chargesum: 0.00000
title: Mulliken charges with hydrogens summed into heavy atoms:
elementType: O O N N N C C C C C C C C C C C C C C C C C C C C C C C
charge: -0.286658 -0.271403 -0.058570 -0.113736 -0.099069 0.214871 0.018962 -0.032108 0.019836 -0.014434 0.067933 -0.137908 0.400997 0.134609 0.164250 -0.180327 0.210225 -0.326567 0.259173 -0.094294 0.306366 -0.100355 -0.078330 -0.144274 0.007381 -0.009833 0.003706 0.139559
polarizability: 2.99336209e+02 -3.80685142e+01 3.14790273e+02 3.03785403e+01 -1.88610212e+00 2.11168753e+02
1716.lowfreq: -1.5376 -1.5209 0.0002 0.0007 0.0010 3.2596 9.7467 15.6548 23.6141
frequency: 8.6812 14.3051 23.0370 29.0361 47.7683 53.8793 69.3347 81.9283 87.9422 115.3766 134.8621 150.0871 161.2678 172.2467 188.1714 211.0482 235.7658 246.5803 253.7042 259.0091 295.8838 311.2572 352.2703 357.5038 377.3702 384.3625 401.7921 409.5504 419.1517 426.3475 429.6467 478.0887 480.5280 482.3871 489.1497 506.0925 519.5578 528.2449 579.2199 597.1507 614.8226 646.5046 658.2706 663.1287 689.0318 694.9622 705.3320 742.0871 749.1771 772.9522 783.3650 791.2095 794.4662 802.0397 804.5512 813.6237 823.1216 840.4561 854.8574 883.6319 904.8592 906.7857 933.0728 934.1136 959.0109 983.2925 989.5174 990.9304 995.8259 1004.9073 1005.2948 1011.7524 1025.9911 1038.1466 1054.9216 1058.9111 1081.1981 1087.9229 1097.4263 1104.9107 1113.3095 1125.2865 1133.7490 1135.6325 1150.8251 1154.7652 1168.6348 1172.8284 1184.0588 1189.9557 1195.1172 1229.8203 1244.6448 1247.9111 1252.3126 1259.6342 1286.5000 1288.1528 1297.2233 1307.8420 1310.5129 1316.1533 1320.0151 1333.1885 1343.0226 1345.4979 1360.5495 1373.0503 1384.3029 1393.4551 1395.3324 1422.0313 1431.3779 1436.9628 1445.0840 1457.1504 1460.2294 1462.4747 1464.0451 1464.3712 1471.1319 1474.4351 1478.0356 1479.0130 1484.1363 1490.7471 1560.8248 1567.6773 1594.7793 1602.8092 1611.1291 1633.3058 2773.5129 2819.3917 2860.4913 2950.4517 2981.9293 2996.2947 3003.3986 3020.0180 3026.5138 3032.5744 3033.7488 3046.5722 3053.5629 3063.0423 3073.8709 3116.8668 3119.2286 3130.7001 3135.7603 3143.6302 3151.6342 3157.0394 3168.5321 3170.8466 3218.1235 3541.2444 3615.9957
redmass: 5.9398 5.0568 5.0090 4.2187 4.1139 6.1759 3.3279 3.9813 3.5527 3.6338 4.9398 3.9012 2.6430 4.2537 3.8255 3.0400 3.9770 1.2000 3.1173 2.8765 3.4322 3.9509 2.5126 3.4864 2.8909 4.7046 2.7902 3.3954 2.9044 2.9675 3.5158 3.6413 3.1336 1.7475 2.3988 3.6251 1.6902 1.9651 4.0250 2.8386 6.3486 3.5690 6.2274 2.7993 4.5939 3.0631 1.6675 3.7661 3.3620 2.2870 1.4423 2.3571 2.0568 1.6907 1.5402 3.7894 3.4037 1.8223 1.2533 3.3527 2.6474 4.1930 1.4632 1.3292 2.5165 1.4097 4.8220 2.6877 4.3448 1.4508 1.5439 1.8003 2.3098 3.3287 2.2298 2.6040 1.5881 1.6147 1.4281 2.4567 1.2621 2.3879 1.2429 2.5728 2.5956 1.3810 1.3135 1.0590 1.1624 1.1311 2.7769 1.6919 2.5715 1.6228 1.3994 1.4932 1.5121 1.2555 1.8296 1.9446 1.5840 1.3360 1.7484 1.4135 1.4720 1.4813 1.3545 1.3674 9.0724 1.5219 4.2619 1.9049 2.2050 1.5269 1.1081 1.6234 1.1063 2.2605 1.2491 1.1026 1.0942 1.1532 1.2685 2.9173 1.2187 1.8829 6.2851 6.8683 6.4229 6.7927 6.1044 7.0609 1.0712 1.0714 1.0698 1.0334 1.0628 1.0624 1.0625 1.0873 1.0847 1.0855 1.1034 1.0876 1.0990 1.1015 1.1014 1.0870 1.0986 1.0870 1.0893 1.0921 1.0909 1.0956 1.1007 1.0955 1.0982 1.0772 1.0809
irintensity: 0.1498 0.5467 1.2798 0.2260 0.1659 7.0733 0.2075 0.3576 8.8235 2.5040 1.9347 0.0464 1.5788 2.0942 1.9362 6.3438 4.4999 1.2833 7.6073 1.0454 1.5882 1.8907 5.5476 0.8939 6.0895 3.8082 0.3353 3.4018 0.6218 7.7449 2.3291 7.8264 3.7375 67.9464 27.6633 4.2639 69.9131 26.1809 4.7330 9.0839 0.4590 14.0809 14.5667 9.5986 15.6218 10.6590 87.1696 2.4895 0.7401 8.1489 2.5616 32.6960 40.3347 3.8839 16.3931 8.6449 9.6211 28.5677 0.9944 11.5074 4.4131 14.9901 4.0072 0.0078 5.9888 1.1479 4.6661 16.1190 40.7550 2.4835 0.5114 13.9277 4.9205 10.4799 3.4281 15.3290 14.4569 23.8631 35.7134 11.8147 0.1872 36.7246 1.6843 3.6325 41.8901 0.6452 12.8600 0.9884 12.2688 6.8642 124.8123 22.3000 14.6308 33.1738 10.1702 30.6714 15.3087 9.5492 29.2103 10.0610 11.8113 3.8285 13.6789 16.0554 30.9230 11.5193 6.1950 4.4399 1.3790 0.5458 17.6598 28.9899 19.7326 10.9906 31.7481 233.0926 18.8299 115.1202 2.2561 18.4072 7.4679 1.1955 0.1280 91.4446 27.6661 126.5329 2.6068 105.6950 22.9468 50.7835 3.4413 29.8235 128.0574 86.6739 103.8135 56.2426 30.7599 26.7112 16.9665 3.1540 50.2808 44.2799 51.6947 39.0346 35.6112 30.9987 28.8828 11.1442 29.3079 1.8718 14.2147 24.2692 11.0736 16.1675 21.4427 9.5156 1.1940 21.6247 67.3692
temp: 298.150 k
press: 1.00000 atm
elementType: 8 8 7 7 7 6 6 6 6 6 6 6 6 6 6 6 6 6 6 6 6 6 6 6 6 6 6 6 1 1 1 1 1 1 1 1 1 1 1 1 1 1 1 1 1 1 1 1 1 1 1 1 1 1 1
symmnumber: 1
zpe: 1199710.8 jmol-1
zpe.correction: 0.456946 hartree
zpe.thermalcorrener: 0.482459 hartree
zpe.thermalcorrenthalpy: 0.483403 hartree
zpe.thermalcorrgfe: 0.397738 hartree
zpe.sumelectzpe: -1205.304979 hartree
zpe.sumelectthermal: -1205.279466 hartree
zpe.sumelectthermalent: -1205.278522 hartree
zpe.sumelectthermalfe: -1205.364187 hartree
dipole: 2.1917 -0.5852 3.6411
dipole: 4.2900
quadrupole: -165.2422 -157.9084 -164.1163
quadrupole: -27.2874 -4.5772 -7.7098
quadrupole: -2.8199 4.5139 -1.6940 -27.2874 -4.5772 -7.7098
hfenergy: -1205.7619252 hartree
pointgroup: C01 [X(C23H27N3O2)]
dipole: -0.8621808 -0.2167564 -1.4346979 debye
polarizability: 298.8315177|37.5244977|315.2866417|30.7885158|3.523707|211.177075 unknown
InChI: InChI=1S/C23H27N3O2/c1-28-20-7-8-22-21(15-20)18(16-24-22)9-12-26-13-10-19(11-14-26)25-23(27)17-5-3-2-4-6-17/h2-8,15-16,19,24-25H,9-14H2,1H3
charge 0 multiplicity 1
55 atoms
O  4.902122 -1.010274 1.695523
O  -3.807551 3.611847 0.71962
N  -0.09882 -2.313424 -0.055686
N  3.436986 -1.21512 -0.093161
N  -5.978798 -1.300576 -0.823855
C  2.828229 -2.464142 0.419657
C  1.808733 -2.186196 1.555311
C  2.126849 -3.223045 -0.728356
C  0.533502 -1.506774 1.021899
C  0.835592 -2.511039 -1.188933
C  -1.404741 -1.762963 -0.498457
C  -2.547401 -2.01736 0.521824
C  -3.869056 -1.458873 0.053607
C  -4.269162 -0.060909 0.048576
C  4.461009 -0.57459 0.581733
C  -4.939222 -2.178126 -0.484194
C  -5.593363 0.008704 -0.504963
C  -3.622839 1.133741 0.476541
C  5.024325 0.66959 -0.062532
C  -6.282658 1.235116 -0.645133
C  -4.317336 2.352048 0.337685
C  -5.632851 2.404658 -0.220311
C  5.748513 1.562155 0.768312
C  4.88828 0.967606 -1.444278
C  6.305403 2.743205 0.235847
C  5.450125 2.14822 -1.978723
C  6.154095 3.042445 -1.139181
C  -2.472255 3.637887 1.311655
H  3.657592 -3.066317 0.832832
H  1.534222 -3.152286 2.019708
H  2.28709 -1.560425 2.329198
H  2.816184 -3.352398 -1.584704
H  1.852773 -4.227912 -0.358775
H  0.783702 -0.475619 0.652247
H  -0.188181 -1.386502 1.84852
H  0.331196 -3.125574 -1.957333
H  1.090041 -1.531407 -1.68588
H  -1.679858 -2.258201 -1.448673
H  -1.338577 -0.666527 -0.717086
H  -2.6174 -3.108016 0.686678
H  -2.281356 -1.566937 1.49835
H  3.026089 -0.78066 -0.920657
H  -5.034928 -3.251245 -0.641999
H  -6.875027 -1.571972 -1.220526
H  -2.616779 1.09122 0.904676
H  -7.292113 1.285869 -1.067845
H  -6.115171 3.383253 -0.301816
H  5.866228 1.298506 1.824515
H  4.382019 0.269402 -2.122253
H  6.858939 3.427928 0.887747
H  5.348721 2.364825 -3.047924
H  6.58914 3.958174 -1.554855
H  -2.432484 3.044858 2.247234
H  -1.707484 3.258354 0.604581
H  -2.273989 4.696494 1.536415
