program: Gaussian 09
title: 000215367
version: EM64L-G09RevD.01
frameworkgroup: C1[X(C14H19NO3S2)]
method: RPBEPBE
basis: SDD
operation: Freq
keyword: #p
keyword: freq=noraman
keyword: PBEPBE/SDD
title: #p freq=noraman PBEPBE/SDD
converged: YES YES NO NO
title: Mulliken charges:
elementType: S S O O O N C C C C C C C C C C C C C C H H H H H H H H H H H H H H H H H H H
charge: 0.182847 -0.060529 -0.289267 -0.294079 -0.296505 -0.040604 -0.341838 -0.353622 -0.675911 -0.657928 -0.419669 0.549792 -0.536285 -0.537809 0.298322 0.243567 0.053096 -0.535575 -0.524065 -0.515329 0.269937 0.234152 0.234341 0.261848 0.259605 0.265274 0.287613 0.258193 0.277780 0.279911 0.223274 0.239196 0.242895 0.265881 0.215611 0.227123 0.217099 0.262262 0.229395
chargesum: 0.00000
title: Mulliken charges with hydrogens summed into heavy atoms:
elementType: S S O O O N C C C C C C C C C C C C C C
charge: 0.182847 -0.060529 -0.289267 -0.294079 -0.296505 -0.040604 0.162250 0.142567 -0.151031 -0.112122 -0.419669 0.549792 -0.258505 -0.257898 0.298322 0.243567 0.053096 0.169790 0.184551 0.193428
polarizability: 2.83603932e+02 -6.75935851e+00 2.09565317e+02 2.02174332e+01 -1.03682061e+01 1.58995612e+02
1716.lowfreq: -11.3775 -9.1992 -0.0016 -0.0012 0.0006 1.1755 23.1021 38.6655 50.2975
frequency: 23.0514 38.5057 50.2871 59.8777 67.8326 81.1018 87.4320 106.8899 127.3501 141.9453 159.7574 165.7159 171.6211 196.8468 202.0786 214.8317 232.8459 267.2196 280.9687 296.6504 311.2728 329.0256 365.4725 375.2269 396.2063 411.1923 442.2640 477.1947 498.4264 512.2497 533.6587 581.7667 601.6773 606.9176 629.5468 633.0453 673.6344 689.9485 754.1075 771.0230 804.1282 850.3259 860.4461 874.1776 889.4887 946.7541 949.2668 953.5038 964.4292 984.9861 1013.0657 1030.3642 1048.0626 1068.0692 1110.6232 1111.9769 1112.8248 1121.7138 1147.6766 1151.2209 1154.0464 1159.7945 1165.5018 1186.2111 1205.9565 1219.3314 1223.1678 1246.2896 1290.8465 1295.4662 1315.2769 1334.0740 1359.6700 1367.3703 1396.4513 1408.9672 1420.8144 1426.2661 1434.2930 1435.2413 1437.6766 1442.9670 1453.7474 1456.8562 1461.7301 1466.8865 1470.5351 1480.3654 1482.3526 1485.5730 1566.5065 1591.4421 2969.2013 2976.4503 2982.2215 2991.8963 3005.2944 3021.5709 3035.1337 3061.5972 3065.8102 3084.8719 3090.5144 3096.5448 3101.6256 3113.6899 3128.1295 3128.2692 3128.9446 3160.8165 3171.2225
redmass: 6.7976 4.4809 5.1287 4.1314 3.6579 2.1407 2.9261 3.0982 3.0524 1.4310 2.3559 2.0435 2.8913 2.8752 3.0432 2.1307 2.7384 6.3845 2.2831 4.7018 4.4713 4.1511 3.4217 4.5684 3.2958 2.4642 4.6347 5.6129 4.8184 4.9332 3.9337 3.3547 4.6617 5.1279 5.3195 4.8589 5.3448 4.4479 3.9037 4.9343 1.6189 2.5432 2.3617 3.3973 1.7189 2.2590 3.8488 3.3640 2.8981 2.6616 2.8705 2.0224 3.2410 6.0187 1.2377 1.2354 1.2560 2.7667 1.6765 1.1958 1.4124 1.4455 2.0744 1.4968 1.6831 1.4191 1.5063 1.8745 1.2591 1.4711 3.2312 1.2544 1.2979 5.4720 2.8122 1.7075 1.2757 1.0879 1.3000 1.2095 1.1465 1.2548 1.1631 1.0677 1.2761 1.0496 1.4788 1.4209 1.1161 1.0654 7.9025 6.6278 1.0324 1.0338 1.0324 1.0599 1.0652 1.0581 1.0587 1.1041 1.1016 1.0984 1.1001 1.0987 1.1060 1.1077 1.1009 1.1047 1.1046 1.0917 1.0905
irintensity: 1.0756 0.1432 2.3510 1.3777 3.3674 8.4175 4.6230 4.5395 1.9209 1.6657 9.3635 1.2760 0.6592 7.4357 3.4525 0.5040 0.6080 2.2624 1.0831 4.0807 4.9130 2.4388 6.2700 7.1398 1.6096 4.8898 9.9547 5.7813 6.1314 4.9584 3.7309 4.4292 1.9993 6.5697 0.9472 2.3743 1.2271 18.6825 10.5242 5.3446 0.1772 26.9167 6.9214 20.8597 34.8845 31.3414 99.2108 19.4256 16.3072 4.5721 3.5582 1.2200 63.5219 215.0043 14.5660 6.2011 0.7545 13.7547 26.8760 8.4761 22.8816 33.4502 43.9632 41.6207 23.2954 57.1035 39.1841 8.8088 8.0904 41.5797 340.8354 3.3462 8.3063 29.8069 62.1042 144.0105 4.2742 5.7910 29.1158 59.7874 35.1337 20.4817 39.0996 4.1916 76.1416 13.4180 35.9950 46.3123 11.3083 30.2177 110.1395 7.1098 52.5709 90.7293 83.0012 37.9941 33.7837 17.9329 16.6020 35.8233 4.8005 32.5710 32.1321 8.0930 11.4934 9.9579 18.0254 16.7575 21.6771 1.8174 1.7520
temp: 298.150 k
press: 1.00000 atm
elementType: 16 16 8 8 8 7 6 6 6 6 6 6 6 6 6 6 6 6 6 6 1 1 1 1 1 1 1 1 1 1 1 1 1 1 1 1 1 1 1
symmnumber: 1
zpe: 811757.5 jmol-1
zpe.correction: 0.309182 hartree
zpe.thermalcorrener: 0.330689 hartree
zpe.thermalcorrenthalpy: 0.331633 hartree
zpe.thermalcorrgfe: 0.257437 hartree
zpe.sumelectzpe: -1619.855931 hartree
zpe.sumelectthermal: -1619.834425 hartree
zpe.sumelectthermalent: -1619.833481 hartree
zpe.sumelectthermalfe: -1619.907677 hartree
dipole: 1.8871 -0.3552 2.3635
dipole: 3.0453
quadrupole: -129.7522 -127.3692 -133.8972
quadrupole: 5.5584 8.2584 9.7472
quadrupole: 0.5873 2.9704 -3.5577 5.5584 8.2584 9.7472
hfenergy: -1620.1651135 hartree
pointgroup: C01 [X(C14H19N1O3S2)]
dipole: -0.7530567 -0.0814374 0.9282794 debye
polarizability: 283.044142|-7.2903051|199.8938247|-19.2061032|24.4843656|169.2268939 unknown
InChI: InChI=1S/C14H19NO3S2/c1-16-11-8-10(9-12(17-2)13(11)18-3)14(19)15-4-6-20-7-5-15/h8-9H,4-7H2,1-3H3
charge 0 multiplicity 1
39 atoms
S  5.142547 -0.276199 1.753843
S  1.876217 -1.491656 -2.175981
O  -3.02049 -1.989554 0.1882
O  -1.951944 2.770751 0.396192
O  -3.841325 0.657268 0.662214
N  2.629956 0.284034 -0.234099
C  2.554504 0.798252 1.161602
C  4.005671 0.269915 -0.792787
C  3.298294 -0.131869 2.143934
C  4.921511 -0.73503 -0.073064
C  1.606206 -0.407784 -0.856104
C  0.204734 -0.140199 -0.402672
C  -0.255169 1.183968 -0.198856
C  -0.708493 -1.216961 -0.280697
C  -2.052343 -0.978166 0.071937
C  -1.600387 1.431342 0.153765
C  -2.513122 0.352271 0.327349
C  -2.616437 -3.3543 -0.170516
C  -3.097845 3.316132 -0.367084
C  -4.416348 -0.020738 1.846395
H  1.499705 0.874552 1.464714
H  3.002208 1.809654 1.192994
H  4.419878 1.291339 -0.692722
H  3.92747 -0.000073 -1.860361
H  3.245053 0.27688 3.167007
H  2.853141 -1.141713 2.133941
H  4.513453 -1.756156 -0.145695
H  5.935553 -0.715577 -0.50507
H  0.402672 2.046286 -0.342022
H  -0.348461 -2.223362 -0.508648
H  -1.830692 -3.733741 0.510599
H  -2.256877 -3.399902 -1.215501
H  -3.528506 -3.959113 -0.06117
H  -4.015052 2.741727 -0.160168
H  -2.872538 3.300743 -1.450914
H  -3.200156 4.355858 -0.020849
H  -3.80728 0.198601 2.743568
H  -4.477494 -1.107938 1.679295
H  -5.421214 0.413756 1.959132
