program: Gaussian 09
title: 000215407
version: EM64L-G09RevD.01
frameworkgroup: C1[X(C21H23NOS)]
method: RPBEPBE
basis: SDD
operation: Freq
keyword: #p
keyword: freq=noraman
keyword: PBEPBE/SDD
title: #p freq=noraman PBEPBE/SDD
converged: YES YES NO NO
title: Mulliken charges:
elementType: S O N C C C C C C C C C C C C C C C C C C C C C H H H H H H H H H H H H H H H H H H H H H H H
charge: 0.227872 -0.443276 -0.264091 -0.548352 -0.390107 0.358644 0.140480 -0.428717 0.170781 -0.387986 -0.386805 0.136667 -0.517439 -0.255639 -0.371567 -0.248045 -0.369591 -0.433605 -0.079729 -0.256769 -0.246687 -0.229507 -0.114595 -0.537473 0.205309 0.200164 0.195298 0.246509 0.205899 0.216527 0.234346 0.266796 0.249605 0.221379 0.241728 0.227091 0.247286 0.228862 0.275584 0.235816 0.222147 0.229458 0.231035 0.257171 0.237575 0.262226 0.337727
chargesum: 0.00000
title: Mulliken charges with hydrogens summed into heavy atoms:
elementType: S O N C C C C C C C C C C C C C C C C C C C C C
charge: 0.227872 -0.105549 0.002704 -0.142878 0.051700 0.358644 0.140480 -0.006290 0.170781 -0.153640 -0.137201 0.136667 -0.054333 -0.028548 -0.124281 -0.019184 -0.094007 0.024358 -0.079729 -0.027311 -0.015652 0.027664 0.122981 -0.275247
polarizability: 2.12588308e+02 -5.69403950e+00 2.67734906e+02 -1.84219155e+00 -7.06010240e-01 2.37591412e+02
1716.lowfreq: -7.9778 -7.7283 -0.0009 0.0005 0.0009 3.8633 7.8079 13.5485 26.7930
frequency: -6.0899 11.2713 26.6895 34.8118 41.6002 56.7755 60.3025 74.4504 82.3360 90.5241 110.6015 154.4625 167.1684 201.7046 209.4448 238.4053 256.5769 273.1615 303.1014 314.0774 325.2870 357.2562 386.4684 394.7913 421.6728 443.2056 458.7368 473.7908 492.5490 515.6639 550.0530 554.0142 564.7411 582.4159 585.9089 596.9450 617.8719 660.9366 690.1632 702.3649 703.9940 738.5005 742.3840 756.6153 759.7439 777.9151 791.4874 815.9747 819.2988 833.0720 857.1015 867.2207 876.2922 881.8553 906.0772 934.6245 944.3125 953.9203 963.0788 982.7544 987.6730 992.0264 994.8503 1001.2714 1035.8180 1036.8808 1044.8385 1052.2187 1066.9755 1086.5368 1093.2919 1111.7697 1130.3470 1135.5125 1161.5427 1171.2437 1173.1739 1184.1691 1198.6086 1202.7045 1205.9371 1239.0304 1255.2499 1271.9519 1279.6664 1283.5833 1298.3212 1311.6831 1316.7564 1329.6631 1340.2735 1348.8198 1354.9621 1356.7777 1370.3881 1378.2940 1429.9084 1430.2465 1433.0589 1452.9788 1459.9162 1461.9453 1464.1166 1471.6919 1472.1165 1474.6115 1490.6155 1547.6633 1573.8604 1580.5081 1607.0437 1607.9347 2952.3999 2958.9850 2978.0071 2981.8817 2984.7541 3028.8954 3035.3785 3042.6369 3048.4373 3063.4138 3115.7963 3121.5477 3125.4820 3133.8762 3139.8874 3145.9544 3157.7428 3160.0086 3160.7413 3176.6409 3235.7540 3483.5233 3554.4750
redmass: 4.9461 5.3381 6.6069 5.4247 6.0303 4.1506 2.8297 3.7265 4.3288 3.9748 3.7888 3.1793 2.9057 4.1200 3.6310 4.1774 3.2706 2.5678 3.3768 3.4196 4.0937 1.2741 2.8786 2.1739 3.3984 2.4491 2.9066 4.5113 3.3781 1.7489 3.4543 4.0623 3.4283 5.3847 5.3435 4.2133 6.8753 4.0940 1.6192 3.6175 3.4145 2.7586 1.7205 1.5807 2.0398 1.5692 3.7406 3.9398 3.0047 1.3443 2.2025 1.9170 1.3512 1.3688 1.3707 2.1880 1.5436 1.4181 2.1890 2.3824 1.3236 1.5262 4.1539 2.6763 2.5367 2.0028 2.1976 2.1073 1.6010 1.4274 2.1927 1.8661 2.5290 1.9348 1.1277 1.0609 1.1273 1.3596 2.2068 2.1071 1.4250 1.3113 1.8588 1.3635 1.5304 1.6679 1.4152 1.4335 1.3191 1.4150 1.4376 1.3345 1.6198 1.4679 3.8055 2.3140 2.2105 2.1102 1.1092 1.1023 1.1031 1.2705 1.3544 1.6909 4.8733 1.1104 2.8663 5.2953 6.4835 6.7653 6.2572 6.2119 1.0652 1.0642 1.0629 1.0640 1.0602 1.0961 1.0932 1.1023 1.0990 1.1006 1.0862 1.0850 1.0879 1.0893 1.0939 1.0944 1.0904 1.1007 1.1005 1.0969 1.0999 1.0747 1.0660
irintensity: 0.4311 0.0034 0.4808 0.1990 0.2932 0.1697 3.0107 1.2241 0.4593 0.1591 0.5927 0.3239 2.5006 0.7004 2.5349 3.3187 2.9780 0.5539 2.5804 9.0906 7.2788 137.5546 8.0826 31.4852 17.6705 7.7272 26.9946 3.3842 11.4528 110.0703 7.8596 0.6144 2.6603 3.0513 13.8428 5.1378 4.1233 18.4988 79.9495 24.3632 33.5167 13.1174 11.5891 82.3280 24.6005 39.8821 6.7380 14.0066 2.0745 22.9697 7.0162 6.3655 0.5195 0.5217 2.2727 10.6586 34.0658 2.3190 73.3043 12.6409 0.0225 2.5540 3.9927 6.7994 4.6527 5.0291 6.2494 8.8741 5.2964 7.7244 0.7677 12.2753 10.6038 15.7353 17.5511 0.7800 4.0406 27.8570 13.1111 1.2976 16.0346 20.4869 2.7171 0.2082 3.3651 2.2745 1.1843 14.7599 1.6910 2.2731 7.3050 6.5705 11.1885 8.9594 3.7028 4.3483 6.5435 7.6531 10.4707 3.6441 12.0914 24.7680 22.8851 11.3537 7.6264 4.7874 7.6485 1.1205 0.7025 1.2821 1.0813 1.2358 57.6715 29.0332 30.4357 33.3848 42.2896 22.5267 13.7314 18.9451 14.5733 43.9271 8.4160 1.1379 3.6005 10.7798 25.4989 15.9732 5.4711 47.9571 12.9500 6.1905 1.0414 0.3984 9.1526
temp: 298.150 k
press: 1.00000 atm
elementType: 16 8 7 6 6 6 6 6 6 6 6 6 6 6 6 6 6 6 6 6 6 6 6 6 1 1 1 1 1 1 1 1 1 1 1 1 1 1 1 1 1 1 1 1 1 1 1
symmnumber: 1
zpe: 1008067.8 jmol-1
zpe.correction: 0.383953 hartree
zpe.thermalcorrener: 0.406192 hartree
zpe.thermalcorrenthalpy: 0.407136 hartree
zpe.thermalcorrgfe: 0.329737 hartree
zpe.sumelectzpe: -1340.294083 hartree
zpe.sumelectthermal: -1340.271844 hartree
zpe.sumelectthermalent: -1340.270899 hartree
zpe.sumelectthermalfe: -1340.348298 hartree
dipole: 0.6522 0.4239 -2.2632
dipole: 2.3931
quadrupole: -156.4754 -139.1656 -150.7633
quadrupole: 0.5745 -6.3737 4.8866
quadrupole: -7.6740 9.6358 -1.9618 0.5745 -6.3737 4.8866
hfenergy: -1340.6780358 hartree
pointgroup: C01 [X(C21H23N1O1S1)]
dipole: -0.3071579 -0.401156 0.7944735 debye
polarizability: 222.4060573|-18.4933005|253.9322161|-11.7931266|8.0857059|241.5763525 unknown
InChI: InChI=1S/C21H23NOS/c23-16-18-8-2-4-12-21(18)20-11-3-1-7-17(20)9-5-13-22-15-19-10-6-14-24-19/h1-4,6-8,10-12,14,22-23H,5,9,13,15-16H2
charge 0 multiplicity 1
47 atoms
S  3.615919 2.365492 1.807885
O  -2.581475 -2.150957 -3.372912
N  2.193787 2.089895 -1.775319
C  -0.81066 1.54802 -0.827786
C  0.193221 2.556746 -0.203398
C  -1.852983 1.044003 0.165276
C  -1.932648 -0.324157 0.571634
C  1.230753 3.074719 -1.241446
C  -1.04998 -1.401074 0.004704
C  -2.752413 1.977208 0.746492
C  -2.875346 -0.697463 1.569766
C  -1.137808 -1.825681 -1.356854
C  3.460667 1.864419 -1.048621
C  -3.69864 1.592523 1.718303
C  -0.131305 -2.05702 0.867195
C  -3.754221 0.244883 2.142332
C  -0.291702 -2.866476 -1.818793
C  -2.152333 -1.214467 -2.321889
C  3.37268 1.291393 0.361626
C  0.70317 -3.095029 0.399823
C  0.628061 -3.497513 -0.953374
C  3.078557 -0.001841 0.773818
C  3.03016 -0.17331 2.206745
C  3.293296 0.989097 2.913485
H  -0.242846 0.693116 -1.237529
H  -1.316049 2.045405 -1.682669
H  -0.362762 3.42911 0.195801
H  0.711518 2.085291 0.651318
H  0.675502 3.515778 -2.096356
H  1.818202 3.896882 -0.788956
H  -2.7030 3.026148 0.4289
H  1.756173 1.221327 -2.101799
H  -2.924719 -1.747982 1.879152
H  4.013503 2.822778 -1.020606
H  4.067723 1.172917 -1.664024
H  -4.383011 2.334887 2.144107
H  -0.068409 -1.7299 1.911319
H  -4.478596 -0.068932 2.90203
H  -0.374832 -3.177564 -2.865918
H  -1.711683 -0.37548 -2.889309
H  -3.023532 -0.818737 -1.762112
H  1.404418 -3.585182 1.084852
H  1.273358 -4.299628 -1.3291
H  2.884618 -0.815557 0.068678
H  2.815426 -1.128342 2.69355
H  3.330219 1.148941 3.989551
H  -2.987873 -2.945687 -2.941971
