program: Gaussian 09
title: 000215324
version: EM64L-G09RevD.01
frameworkgroup: C1[X(C19H26N4O)]
method: RPBEPBE
basis: SDD
operation: Freq
keyword: #p
keyword: freq=noraman
keyword: PBEPBE/SDD
title: #p freq=noraman PBEPBE/SDD
converged: YES YES NO NO
title: Mulliken charges:
elementType: O N N N N C C C C C C C C C C C C C C C C C C C H H H H H H H H H H H H H H H H H H H H H H H H H H
charge: -0.288645 -0.080544 -0.056196 -0.170456 -0.046074 -0.352962 -0.358091 -0.380528 -0.370300 -0.329309 -0.375405 -0.372603 -0.345869 -0.693295 0.244112 0.030976 -0.318805 -0.204439 0.358722 -0.371688 -0.361677 -0.241959 -0.228414 -0.238455 0.192235 0.201149 0.202769 0.182693 0.195531 0.244787 0.212556 0.198604 0.171022 0.197351 0.228818 0.244325 0.206551 0.194388 0.192479 0.192271 0.215230 0.209600 0.211543 0.258742 0.230126 0.215866 0.266329 0.227539 0.228085 0.231314
chargesum: 0.00000
title: Mulliken charges with hydrogens summed into heavy atoms:
elementType: O N N N N C C C C C C C C C C C C C C C C C C C
charge: -0.288645 -0.080544 -0.056196 -0.170456 -0.046074 0.040422 0.027371 0.059790 0.040861 0.039064 0.097738 0.028335 0.038881 -0.056922 0.244112 0.030976 -0.060063 0.025687 0.358722 -0.155823 -0.095348 -0.014420 -0.000329 -0.007141
polarizability: 3.44135523e+02 5.36532822e+01 2.38932004e+02 2.81593762e+01 -2.12692119e+01 1.77747020e+02
1716.lowfreq: -11.1166 -4.2286 0.0006 0.0007 0.0011 2.3172 10.7061 14.6551 19.3318
frequency: 9.4515 14.0543 18.6235 34.8282 54.1588 55.2757 68.2590 78.1794 97.8439 116.5858 127.5523 147.2374 184.7394 203.1975 220.3556 231.8141 250.8495 265.5866 291.3275 292.1315 304.7019 321.3303 380.3868 384.3961 391.5408 401.8069 417.6490 446.3595 484.5892 487.4903 488.5128 518.8840 569.4762 588.1824 605.8425 616.3281 627.7238 696.4625 697.1395 731.4182 737.1447 742.4316 761.2320 780.5336 787.2828 798.4561 834.7874 847.7331 850.9560 872.0205 895.8810 909.6132 927.9106 935.6246 971.1073 975.3812 982.6496 988.7902 997.1873 1001.2716 1013.7739 1020.5957 1041.5360 1051.1052 1058.0123 1075.3833 1078.9043 1084.8534 1094.4450 1108.6893 1121.9435 1130.9421 1141.0914 1153.0069 1171.2893 1173.9033 1180.0687 1194.4652 1198.6145 1216.9550 1236.6297 1246.9067 1271.7740 1279.0888 1283.9353 1289.4374 1299.5354 1301.6534 1316.8399 1329.6522 1333.2689 1336.3485 1345.5799 1365.4378 1365.6164 1379.9573 1384.4367 1388.1680 1391.6616 1393.6463 1396.9608 1424.7857 1448.3085 1451.9242 1455.2687 1461.9459 1465.2541 1467.7208 1468.8523 1472.4549 1477.1365 1480.9467 1489.7991 1491.6023 1558.1852 1586.9836 1612.3464 1635.6694 2829.3501 2850.8256 2863.5140 2883.9267 2893.1881 2962.2484 2972.6606 2977.7537 2997.5559 3002.1790 3005.5421 3026.5836 3037.0671 3044.1016 3055.0097 3060.5644 3070.0304 3071.3764 3084.0294 3126.1552 3134.2228 3146.6629 3154.6364 3160.7295 3171.4259 3181.7324
redmass: 4.2668 3.9617 4.8769 2.9014 2.0780 2.5501 3.6603 7.0758 4.2418 2.6969 4.2194 3.7650 3.1775 3.5046 4.3943 1.1752 2.0448 2.8395 2.8971 3.9382 5.3802 4.3075 4.9715 2.2159 2.3793 2.8279 3.8989 2.8456 4.0876 3.9487 2.9439 3.7749 3.5766 5.4087 3.3838 3.4590 4.4996 1.9776 4.3198 4.5678 1.0777 4.8298 4.2549 2.1014 2.9604 1.2229 1.6976 1.5507 1.2803 7.0623 1.8452 1.9795 1.4548 1.3028 2.3147 1.3667 1.3638 5.7610 2.7569 1.3310 2.6527 3.0041 2.7013 1.9708 2.0740 2.3409 2.2447 1.6712 2.5325 2.3759 2.0015 1.9229 2.6354 2.8001 2.1643 1.0562 1.9315 1.1530 1.1449 1.4428 1.7068 1.9357 1.5680 1.3246 1.4466 1.1747 1.3554 2.5428 1.3996 1.3350 1.3521 1.3727 1.4926 1.5425 1.3975 2.6663 1.9738 1.3139 1.5685 1.4173 2.0661 2.4743 1.1117 1.0830 1.1111 1.1160 1.1918 1.1536 2.3191 1.0871 1.0427 1.0715 1.0914 2.5694 6.5623 6.0816 6.0385 8.1292 1.0702 1.0707 1.0695 1.0693 1.0692 1.0586 1.0372 1.0601 1.0856 1.0613 1.0996 1.0898 1.0895 1.1028 1.0900 1.0904 1.1007 1.0994 1.1029 1.0847 1.0881 1.0931 1.0891 1.0956 1.0994 1.0979
irintensity: 0.0297 0.0716 0.1620 0.1656 0.3030 0.1181 0.0506 2.1974 2.9692 1.5057 1.0065 2.3079 4.0864 2.5283 2.6513 0.7099 0.3392 2.0165 4.2484 4.0061 2.0568 1.3937 10.4981 1.7105 0.8061 0.1886 3.3749 1.6793 7.1194 10.3503 1.1620 12.8452 20.0562 10.6628 4.9711 1.4551 7.8705 43.7978 19.7016 8.8315 8.2939 33.2432 1.4568 58.0875 18.7962 2.6307 30.3156 0.2564 2.9674 71.8821 7.7293 20.3722 3.2454 4.3658 11.9098 0.7420 0.3357 0.0081 51.5660 0.5305 61.1431 19.8360 0.6773 4.0581 5.0172 18.9291 0.8022 6.5069 2.5460 33.7292 60.0829 45.2886 44.0841 58.6928 42.0086 0.6054 56.3652 0.4436 7.1558 2.1080 3.7543 11.4656 10.2559 13.3260 43.8155 18.3011 15.9176 10.7991 5.9096 16.9716 9.2515 7.6750 1.3612 59.2347 20.4563 1.0756 5.5820 12.7979 2.6631 4.1494 7.4094 17.0297 8.9359 2.1325 13.7627 18.5890 2.9735 1.1745 6.3972 2.5122 11.9338 2.3671 16.3940 47.7343 153.3259 8.7975 24.5790 213.3854 62.9849 64.4546 67.5444 57.3286 221.9047 25.2728 34.6046 40.2110 28.8009 44.3001 2.3114 44.1915 37.9277 48.1618 41.5260 9.8589 91.9357 55.1356 4.6100 4.1987 5.7555 24.3317 7.5650 30.6854 16.3029 6.4032
temp: 298.150 k
press: 1.00000 atm
elementType: 8 7 7 7 7 6 6 6 6 6 6 6 6 6 6 6 6 6 6 6 6 6 6 6 1 1 1 1 1 1 1 1 1 1 1 1 1 1 1 1 1 1 1 1 1 1 1 1 1 1
symmnumber: 1
zpe: 1106417.9 jmol-1
zpe.correction: 0.421412 hartree
zpe.thermalcorrener: 0.444535 hartree
zpe.thermalcorrenthalpy: 0.445479 hartree
zpe.thermalcorrgfe: 0.364440 hartree
zpe.sumelectzpe: -1032.011850 hartree
zpe.sumelectthermal: -1031.988727 hartree
zpe.sumelectthermalent: -1031.987783 hartree
zpe.sumelectthermalfe: -1032.068822 hartree
dipole: -1.7979 -2.2570 -0.7239
dipole: 2.9750
quadrupole: -127.6996 -147.6746 -139.6248
quadrupole: -0.3785 5.8009 -3.1410
quadrupole: 10.6334 -9.3416 -1.2918 -0.3785 5.8009 -3.1410
hfenergy: -1032.4332624 hartree
pointgroup: C01 [X(C19H26N4O1)]
dipole: -0.5962177 -0.9248769 0.3988582 debye
polarizability: 330.8720419|64.6183132|204.6901592|-22.2098347|-44.2107331|225.2523461 unknown
InChI: InChI=1S/C19H26N4O/c1-2-3-11-21-12-14-22(15-13-21)16-23-19(24)10-9-18(20-23)17-7-5-4-6-8-17/h4-10H,2-3,11-16H2,1H3
charge 0 multiplicity 1
50 atoms
O  -0.481428 2.354365 -2.171189
N  3.661834 -0.147588 0.149212
N  1.100431 1.141313 0.342018
N  -1.278148 1.293761 -0.227546
N  -2.128108 0.486826 0.474618
C  3.234673 0.852699 -0.865317
C  2.477351 -0.883246 0.660676
C  2.243278 1.8575 -0.254419
C  1.4742 0.090268 1.304062
C  4.710985 -1.072888 -0.350595
C  -0.125647 1.863104 0.566629
C  6.079645 -0.395321 -0.567265
C  7.184858 -1.412732 -0.933163
C  8.555953 -0.744247 -1.171826
C  -1.339084 1.585869 -1.631725
C  -3.143077 -0.113167 -0.190804
C  -2.452199 0.925102 -2.303248
C  -3.317094 0.101125 -1.609899
C  -4.040565 -0.984929 0.614941
C  -5.283869 -1.447315 0.102631
C  -3.668117 -1.368965 1.933834
C  -6.12432 -2.271393 0.882069
C  -4.508294 -2.190191 2.710433
C  -5.74187 -2.649226 2.188859
H  2.747347 0.354466 -1.742079
H  4.120553 1.401875 -1.228782
H  2.814651 -1.615094 1.418681
H  1.955751 -1.443869 -0.157588
H  2.785059 2.469921 0.505748
H  1.858001 2.520613 -1.048416
H  0.565817 -0.464037 1.604564
H  1.938617 0.525019 2.222466
H  4.393887 -1.579368 -1.300998
H  4.833982 -1.870942 0.408798
H  -0.474658 1.819174 1.615386
H  -0.018573 2.912044 0.24386
H  6.354242 0.144869 0.359962
H  6.014868 0.363364 -1.372623
H  6.883742 -1.973595 -1.841924
H  7.276135 -2.162642 -0.12064
H  9.331081 -1.490111 -1.427113
H  8.50209 -0.014788 -2.001988
H  8.893418 -0.200176 -0.269624
H  -2.554695 1.107934 -3.376412
H  -4.128728 -0.404805 -2.140301
H  -5.617782 -1.156329 -0.899031
H  -2.714507 -1.010435 2.332219
H  -7.080022 -2.613389 0.46957
H  -4.20187 -2.47637 3.722775
H  -6.394692 -3.289357 2.792306
