program: Gaussian 09
title: 000215347
version: EM64L-G09RevD.01
frameworkgroup: C1[X(C18H27NO4)]
method: RPBEPBE
basis: SDD
operation: Freq
keyword: #p
keyword: freq=noraman
keyword: PBEPBE/SDD
title: #p freq=noraman PBEPBE/SDD
converged: YES YES NO NO
title: Mulliken charges:
elementType: O O O O N C C C C C C C C C C C C C C C C C C H H H H H H H H H H H H H H H H H H H H H H H H H H H
charge: -0.233173 -0.270623 -0.315361 -0.258376 -0.090172 -0.360023 -0.352347 -0.396916 -0.398425 -0.399477 -0.363108 -0.433509 -0.514387 0.067422 0.107431 0.249905 0.209712 -0.548542 -0.530934 0.391260 -0.543147 -0.518050 -0.534458 0.176301 0.207866 0.223280 0.166015 0.203701 0.192580 0.191954 0.203287 0.214319 0.189170 0.247893 0.191782 0.224426 0.226805 0.215856 0.282219 0.279703 0.266386 0.255882 0.223997 0.262933 0.222509 0.238782 0.233053 0.221262 0.225370 0.247972
chargesum: 0.00000
title: Mulliken charges with hydrogens summed into heavy atoms:
elementType: O O O O N C C C C C C C C C C C C C C C C C C
charge: -0.233173 -0.270623 -0.315361 -0.258376 -0.090172 0.024143 0.036948 -0.000636 -0.003184 0.004012 0.076567 0.017722 -0.016313 0.067422 0.107431 0.249905 0.209712 -0.268840 -0.264548 0.391260 0.199665 0.176293 0.160146
polarizability: 2.80452894e+02 -1.18942815e+01 2.16191781e+02 -3.03046560e+01 -5.14219589e+00 1.72910282e+02
1716.lowfreq: -13.3806 -12.4823 -7.0128 -0.0009 -0.0006 0.0005 5.9191 14.7787 26.6096
frequency: -10.9915 14.1539 26.0274 29.9684 41.9890 69.3416 89.4214 97.3589 108.9927 122.6211 128.9961 149.7147 154.8651 177.1389 207.3952 210.9541 212.5683 225.7798 235.7250 244.7198 261.7481 286.3780 293.3491 297.0920 330.4257 336.2777 354.1319 370.0075 391.9048 397.6306 442.7595 447.6252 466.6190 499.9225 506.8079 543.4442 560.3973 610.0078 629.9519 637.2624 650.6179 704.5461 748.2183 771.2400 800.6016 803.3535 838.7301 848.2762 855.1529 855.9808 871.0267 879.5069 883.1456 915.3578 957.3670 958.7460 973.0634 994.3935 1020.5085 1024.9755 1040.0311 1046.1215 1055.4305 1075.0259 1085.8445 1109.6004 1111.1629 1111.3645 1113.4600 1121.5102 1133.6580 1148.0147 1150.3045 1153.0369 1157.0663 1158.1788 1167.9302 1183.4501 1198.4321 1235.3991 1254.2891 1257.3046 1265.4942 1279.0214 1283.6071 1293.4220 1303.1751 1324.6026 1330.3662 1339.7088 1345.2470 1348.6244 1356.2477 1372.1716 1393.5069 1400.3893 1421.3998 1439.5169 1447.6139 1449.2688 1454.2199 1458.3462 1459.9080 1461.0101 1464.2500 1466.4618 1466.6184 1470.4855 1472.6393 1473.5591 1476.4108 1478.3235 1481.1679 1492.0828 1540.4800 1569.4619 1618.6438 2813.8081 2824.4765 2843.8408 2959.7873 2963.8871 2967.1918 2979.8140 2982.4291 2984.6137 2987.4208 3008.0308 3017.3861 3023.1825 3033.3414 3040.4533 3043.8853 3049.5693 3050.2610 3053.1821 3053.5711 3090.3088 3096.3631 3115.7999 3117.4452 3128.0618 3178.9539 3189.2025
redmass: 3.4477 4.1666 3.4257 3.3714 3.8683 3.7292 3.3911 4.1784 4.0479 3.6990 3.8748 1.2864 2.5362 2.8840 3.6458 2.0269 2.3304 1.9501 1.8693 2.6153 3.4887 1.7690 2.2826 1.9836 4.0675 3.1708 4.0245 2.2759 5.0686 2.1150 5.0325 2.9347 2.6772 5.4130 5.7425 4.9773 1.8475 4.4311 4.6879 3.3535 3.9636 3.2514 2.9870 2.7042 1.6137 1.6083 1.7477 2.6789 1.4864 4.5644 1.7129 6.6573 2.8034 2.1712 1.3079 3.0921 6.9625 2.6895 2.8260 3.0062 2.5048 3.3360 2.2158 2.2493 1.5145 2.0281 1.2455 1.2578 1.3911 2.4814 1.8129 1.3732 1.2967 2.3565 1.6165 1.4533 1.5196 1.2703 1.5230 1.8803 2.2046 1.2571 1.1733 1.1967 4.8459 1.4068 1.3371 1.4072 1.2931 1.4143 1.4731 1.4825 5.0635 1.3952 1.4256 3.1676 1.5831 1.2820 1.3588 1.0910 1.4964 1.0753 1.2389 1.0795 1.0867 1.0879 1.0517 1.0674 1.0635 1.0774 1.0910 1.0860 1.0896 1.0929 6.9776 7.7945 7.3909 1.0717 1.0709 1.0703 1.0312 1.0328 1.0626 1.0313 1.0617 1.0610 1.0598 1.0648 1.0872 1.0853 1.0950 1.0891 1.1023 1.1007 1.1042 1.1036 1.1041 1.1028 1.1001 1.1039 1.1012 1.0997 1.0914 1.0921
irintensity: 1.7966 0.6464 1.3091 0.3030 0.7290 5.8589 2.0672 4.5888 2.0452 1.3785 4.4280 0.4177 1.0937 2.1383 4.7316 1.3295 5.7206 1.6942 0.3324 5.3509 4.0550 2.2464 3.5379 8.9539 3.9162 4.6351 1.6818 0.9944 2.4920 5.6183 1.4876 0.3823 1.6759 11.4274 1.3308 14.0253 2.0558 2.3720 25.4564 7.5281 6.4878 2.6071 4.8057 18.2913 6.0145 11.6017 7.0179 3.1099 7.7682 13.6645 49.7211 10.0870 1.9996 5.8298 2.6520 25.4074 48.0824 42.0978 24.8731 19.3670 33.6493 83.1732 24.1348 28.4946 14.5048 34.7403 0.6572 0.4569 8.7907 6.5715 191.9018 5.3485 5.5591 11.0059 42.3932 13.1080 78.7829 53.4214 37.1240 29.8187 179.2078 16.5621 6.4355 10.9716 9.8475 16.4049 3.3582 42.0360 8.4825 0.7817 16.1122 3.4504 83.6222 2.2524 0.1183 31.7923 6.7505 11.7493 11.3622 5.3259 2.7232 22.1258 22.1883 7.8832 15.9975 8.0359 13.4825 0.6600 46.7827 23.0074 15.9559 7.9207 18.2571 34.5222 186.6101 128.9687 440.4425 55.5062 64.4218 205.7916 55.1465 72.1539 40.4252 26.1128 27.9096 39.0201 10.8584 13.1635 43.6682 24.5343 69.7698 30.5477 16.4779 48.4290 45.2765 104.8684 44.2245 21.9774 4.2703 21.3431 25.5973 24.0490 1.9273 0.2187
temp: 298.150 k
press: 1.00000 atm
elementType: 8 8 8 8 7 6 6 6 6 6 6 6 6 6 6 6 6 6 6 6 6 6 6 1 1 1 1 1 1 1 1 1 1 1 1 1 1 1 1 1 1 1 1 1 1 1 1 1 1 1
symmnumber: 1
zpe: 1106106.8 jmol-1
zpe.correction: 0.421294 hartree
zpe.thermalcorrener: 0.444998 hartree
zpe.thermalcorrenthalpy: 0.445942 hartree
zpe.thermalcorrgfe: 0.366698 hartree
zpe.sumelectzpe: -1055.902000 hartree
zpe.sumelectthermal: -1055.878296 hartree
zpe.sumelectthermalent: -1055.877352 hartree
zpe.sumelectthermalfe: -1055.956595 hartree
dipole: 0.8653 1.5029 -2.6592
dipole: 3.1747
quadrupole: -107.3235 -136.9836 -144.6213
quadrupole: 5.3990 -6.9308 0.7743
quadrupole: 22.3193 -7.3408 -14.9785 5.3990 -6.9308 0.7743
hfenergy: -1056.3232939 hartree
pointgroup: C01 [X(C18H27N1O4)]
dipole: -0.2087454 -0.6828855 -1.0247706 debye
polarizability: 281.8055256|1.8638563|214.806677|30.1503993|9.2939214|172.942755 unknown
InChI: InChI=1S/C18H27NO4/c1-21-14-12-16(22-2)18(17(13-14)23-3)15(20)8-7-11-19-9-5-4-6-10-19/h12-13H,4-11H2,1-3H3
charge 0 multiplicity 1
50 atoms
O  0.265122 -1.51542 2.227002
O  -0.846201 1.448851 1.676436
O  -2.173097 -2.827783 -0.578199
O  -4.99135 1.167546 -0.482824
N  3.53931 0.27984 -0.050634
C  4.492536 0.689113 1.015614
C  4.182763 0.32772 -1.389838
C  5.017347 2.118815 0.775578
C  4.704562 1.744064 -1.708422
C  5.682969 2.229508 -0.61497
C  2.923586 -1.039075 0.245713
C  1.740517 -1.371722 -0.694009
C  0.692272 -2.318914 -0.028317
C  -0.121849 -1.554252 1.01627
C  -1.343252 -0.794608 0.569611
C  -1.645567 0.561733 0.95685
C  -2.354311 -1.468666 -0.189967
C  -2.871663 1.163245 0.58613
C  -3.573239 -0.878431 -0.562953
C  -3.82667 0.459202 -0.16801
C  0.612095 1.327212 1.822901
C  -2.573296 -3.80636 0.453765
C  -5.999763 0.486899 -1.3011
H  5.364722 -0.016452 1.069345
H  3.967532 0.631766 1.988182
H  3.441925 0.022632 -2.150263
H  5.036781 -0.400996 -1.445401
H  4.166907 2.825909 0.835205
H  5.734164 2.386934 1.575504
H  5.19697 1.73938 -2.700107
H  3.841598 2.435661 -1.765996
H  6.001493 3.270599 -0.81227
H  6.598104 1.601479 -0.635181
H  2.558483 -1.008458 1.289051
H  3.67652 -1.868998 0.196909
H  1.245427 -0.429532 -1.000415
H  2.098376 -1.859225 -1.62019
H  1.217961 -3.151751 0.47587
H  0.025032 -2.728137 -0.802616
H  -3.055897 2.200557 0.873779
H  -4.285514 -1.477372 -1.135093
H  1.105901 1.074021 0.866496
H  0.9316 2.331383 2.142566
H  0.861776 0.57515 2.588814
H  -3.646889 -3.693044 0.700077
H  -1.971097 -3.684785 1.374615
H  -2.390512 -4.797657 0.011659
H  -6.402963 -0.404507 -0.782773
H  -5.5861 0.190841 -2.284269
H  -6.800617 1.227189 -1.441827
