program: Gaussian 09
title: 000215289
version: EM64L-G09RevD.01
frameworkgroup: C1[X(C15H13NO2)]
method: RPBEPBE
basis: SDD
operation: Freq
keyword: #p
keyword: freq=noraman
keyword: PBEPBE/SDD
title: #p freq=noraman PBEPBE/SDD
converged: YES YES NO NO
title: Mulliken charges:
elementType: O O N C C C C C C C C C C C C C C C H H H H H H H H H H H H H
charge: -0.227268 -0.243793 -0.247274 -0.352463 0.344362 0.300472 0.366608 -0.411135 0.215870 -0.364151 -0.377102 -0.338440 -0.254124 -0.646899 -0.233066 -0.236029 -0.232402 -0.235972 0.260905 0.245804 0.249199 0.251775 0.265038 0.233900 0.233271 0.235825 0.278337 0.230145 0.227170 0.230945 0.230492
chargesum: 0.00000
title: Mulliken charges with hydrogens summed into heavy atoms:
elementType: O O N C C C C C C C C C C C C C C C
charge: -0.227268 -0.243793 -0.247274 -0.091558 0.344362 0.300472 0.366608 -0.165330 0.215870 -0.114951 -0.125327 -0.073401 -0.020224 0.100533 -0.002921 -0.008858 -0.001458 -0.005480
polarizability: 1.94065585e+02 -2.57506275e+01 1.77777940e+02 8.30135353e+00 -2.40670801e+00 1.26186264e+02
1716.lowfreq: -16.4299 -0.0007 -0.0002 0.0004 6.1285 10.4818 32.2143 43.8303 67.1881
frequency: 31.1904 43.8094 67.1823 88.9194 127.0144 167.8086 204.9443 223.4931 259.0608 268.3750 339.0033 343.3500 374.4454 402.9126 427.1500 435.3746 456.6008 484.2416 528.6955 579.2211 594.1417 612.6577 616.1906 661.8247 694.5311 703.3144 725.9210 740.2227 757.6423 762.7785 842.2597 856.3722 859.2057 867.8471 880.2265 937.0260 942.8557 951.4371 981.0433 985.4516 989.8655 1000.4320 1028.1584 1034.7536 1048.7865 1080.8690 1097.3065 1125.0872 1133.7699 1173.7896 1176.2914 1179.2934 1192.6249 1218.0082 1239.1513 1266.5668 1274.6301 1314.8548 1319.2672 1336.3809 1382.8560 1394.0121 1427.9280 1435.7805 1452.8830 1474.1666 1480.8854 1495.7030 1499.1910 1592.1405 1599.8346 1611.2445 1617.1083 1654.8298 2984.4523 3039.4251 3072.7809 3125.1035 3126.7685 3134.5410 3134.5594 3139.1889 3146.2271 3154.6464 3162.1697 3166.7140 3175.1446
redmass: 3.9021 4.4872 5.1056 7.6351 3.0929 4.2637 1.1939 4.3141 5.1180 4.0193 4.2974 4.4117 5.2262 2.8567 7.5999 4.9212 4.2160 4.0563 4.0436 6.0710 5.7370 4.8763 6.3843 6.6005 7.7309 2.4295 2.6209 2.5752 3.1604 1.4115 2.5210 3.5449 1.3155 1.7616 3.7642 1.5715 1.6535 3.5208 1.3208 1.4090 5.6133 1.3223 2.2587 2.8205 3.5346 1.8058 1.9828 1.3483 1.5551 1.0535 1.0697 2.8611 1.1528 1.5828 1.7989 3.5828 1.2923 1.9329 2.0758 1.5171 8.2125 7.0539 1.2208 2.1377 2.3346 1.1152 2.1896 2.1765 1.2025 6.2013 7.3609 6.0460 6.7298 10.4496 1.0383 1.0856 1.0991 1.0849 1.0880 1.0911 1.0953 1.0891 1.0922 1.0961 1.0945 1.1014 1.0981
irintensity: 0.3863 0.5102 1.4477 2.5974 2.4382 0.1696 0.3672 0.7363 0.8594 1.5957 0.9979 3.2697 8.4329 0.2936 3.0871 3.1807 5.4347 4.7261 4.0213 6.6240 0.1704 12.8127 0.5121 14.5349 10.9125 19.6957 57.1525 40.4452 7.6534 93.4472 0.4350 9.9656 1.4851 0.8474 11.5103 10.2981 15.4002 48.4642 0.1254 1.2434 1.3299 0.8641 9.5988 10.8040 94.2129 42.7104 63.9095 2.2142 7.5408 0.0224 0.3212 15.4955 2.9871 8.7957 67.6734 28.8238 7.9253 25.4171 33.1857 22.1523 1.0685 3.4734 25.6905 11.7793 34.0339 50.6568 17.3102 102.8946 4.7645 0.9595 7.9955 14.5289 118.2915 420.4648 43.7111 8.7486 23.9938 0.5000 4.3208 5.0410 0.7504 10.5324 15.1716 21.7436 23.2065 21.7687 12.5963
temp: 298.150 k
press: 1.00000 atm
elementType: 8 8 7 6 6 6 6 6 6 6 6 6 6 6 6 6 6 6 1 1 1 1 1 1 1 1 1 1 1 1 1
symmnumber: 1
zpe: 638422.5 jmol-1
zpe.correction: 0.243162 hartree
zpe.thermalcorrener: 0.257626 hartree
zpe.thermalcorrenthalpy: 0.258570 hartree
zpe.thermalcorrgfe: 0.200934 hartree
zpe.sumelectzpe: -783.347964 hartree
zpe.sumelectthermal: -783.333500 hartree
zpe.sumelectthermalent: -783.332556 hartree
zpe.sumelectthermalfe: -783.390192 hartree
dipole: 1.4252 -4.1016 2.2421
dipole: 4.8869
quadrupole: -90.7125 -112.7054 -100.6800
quadrupole: 0.2312 3.7466 6.3404
quadrupole: 10.6535 -11.3395 0.6860 0.2312 3.7466 6.3404
hfenergy: -783.5911259 hartree
pointgroup: C01 [X(C15H13N1O2)]
dipole: -0.2442629 -1.5793782 -1.0688545 debye
polarizability: 182.682459|26.309606|188.4232558|6.7493948|10.0894825|126.9240738 unknown
InChI: InChI=1S/C15H13NO2/c1-16-13-10-6-5-9-12(13)14(18-15(16)17)11-7-3-2-4-8-11/h2-10,14H,1H3
charge 0 multiplicity 1
31 atoms
O  -0.105039 1.13019 1.723304
O  -0.80764 3.133051 0.83281
N  -1.53619 1.146003 -0.185525
C  0.345546 -0.248936 1.316215
C  -0.834116 -1.00105 0.748254
C  -1.740077 -0.258542 -0.057273
C  1.56006 -0.133116 0.383281
C  -1.039619 -2.378874 0.949469
C  -0.808616 1.884678 0.769983
C  -2.817285 -0.922308 -0.696298
C  1.726002 -0.986504 -0.733977
C  2.564275 0.824944 0.680112
C  -2.117327 -3.044938 0.320742
C  -2.2896 1.912516 -1.196827
C  -2.994347 -2.310894 -0.50911
C  2.881014 -0.885967 -1.543792
C  3.713577 0.927438 -0.131868
C  3.87786 0.069525 -1.245532
H  0.658961 -0.682187 2.282095
H  -0.343112 -2.937328 1.586253
H  -3.52225 -0.367113 -1.320871
H  0.955578 -1.726597 -0.975475
H  2.425381 1.499996 1.531598
H  -2.267374 -4.118259 0.47376
H  -3.368004 1.952914 -0.952709
H  -2.15567 1.455039 -2.191991
H  -1.899378 2.939983 -1.203851
H  -3.830383 -2.815994 -1.005163
H  2.998564 -1.550605 -2.407095
H  4.478699 1.675947 0.102049
H  4.771513 0.148885 -1.874666
