program: Gaussian 09
title: 000215270
version: EM64L-G09RevD.01
frameworkgroup: C1[X(C10H7NO2)]
method: RPBEPBE
basis: SDD
operation: Freq
keyword: #p
keyword: freq=noraman
keyword: PBEPBE/SDD
title: #p freq=noraman PBEPBE/SDD
converged: NO YES NO NO
title: Mulliken charges:
elementType: O O N C C C C C C C C C C H H H H H H H
charge: -0.249742 -0.258847 -0.016653 0.162670 0.205207 0.210486 -0.417864 -0.374516 -0.383480 0.304823 -0.187481 -0.530785 -0.199938 0.295274 0.262251 0.242863 0.231265 0.227096 0.227096 0.250275
chargesum: 0.00000
title: Mulliken charges with hydrogens summed into heavy atoms:
elementType: O O N C C C C C C C C C C
charge: -0.249742 -0.258847 -0.016653 0.162670 0.205207 0.210486 -0.122590 -0.112265 -0.140617 0.304823 0.043783 0.173683 -0.199938
polarizability: 2.05295889e+02 -1.39011769e+01 1.26226849e+02 7.24432744e-04 -8.64467988e-04 5.17238995e+01
1716.lowfreq: -2.5287 -0.0007 0.0007 0.0008 7.4764 12.1449 81.8585 108.1149 116.7030
frequency: 81.8584 108.1058 116.7029 176.1083 204.9147 229.3831 259.6887 287.8747 324.4894 417.1261 447.9136 463.3288 538.3594 563.8544 586.1913 602.8503 616.6262 634.8527 706.5401 734.8852 781.5069 842.3684 863.5511 872.7931 898.2054 923.1165 956.0173 1046.6917 1054.5329 1114.4603 1129.6170 1155.7957 1169.3296 1190.7376 1237.2532 1256.6934 1295.0690 1409.0748 1425.4775 1440.9026 1468.0436 1471.1221 1488.5454 1546.2137 1606.3748 1617.3850 2180.3317 2968.4690 3060.0460 3134.4832 3147.3980 3172.8468 3190.2497 3246.7944
redmass: 4.4447 4.7753 7.5806 3.0184 4.6713 1.4690 4.9076 3.4175 4.0391 7.7027 8.1567 8.7256 3.7614 6.4576 7.6499 5.1798 5.3947 5.4732 7.1518 1.8400 2.1648 4.0898 1.3936 1.4627 8.9635 8.0253 1.3133 5.0154 1.8957 1.2580 1.6801 1.3454 2.2782 1.8442 2.1614 3.6396 3.7085 2.6709 2.9702 1.5986 1.0495 1.1128 2.6962 8.1250 7.4189 9.1395 12.5885 1.0326 1.1044 1.1001 1.0877 1.0926 1.0973 1.0993
irintensity: 1.3440 2.4876 0.6178 6.8720 5.2579 2.4516 0.6834 2.8007 0.6953 5.7156 6.4441 0.2825 0.3339 3.6502 6.6935 0.0189 2.8202 1.4834 5.6750 24.7580 78.7962 2.8657 2.2956 26.8431 10.5706 3.1771 2.1739 96.0999 15.5662 0.0828 47.2491 0.9030 40.3342 34.1691 4.6204 127.2669 0.1367 9.8534 61.3775 9.7051 15.0000 61.1486 49.1411 8.4769 92.7863 47.0667 79.7188 66.2503 41.6684 17.8374 7.2069 11.4079 4.7632 3.7095
temp: 298.150 k
press: 1.00000 atm
elementType: 8 8 7 6 6 6 6 6 6 6 6 6 6 1 1 1 1 1 1 1
symmnumber: 1
zpe: 379593.9 jmol-1
zpe.correction: 0.144580 hartree
zpe.thermalcorrener: 0.155259 hartree
zpe.thermalcorrenthalpy: 0.156203 hartree
zpe.thermalcorrgfe: 0.108077 hartree
zpe.sumelectzpe: -589.517311 hartree
zpe.sumelectthermal: -589.506632 hartree
zpe.sumelectthermalent: -589.505688 hartree
zpe.sumelectthermalfe: -589.553814 hartree
dipole: -7.3256 0.2381 -0.0001
dipole: 7.3294
quadrupole: -82.9593 -67.4477 -77.1197
quadrupole: 5.4426 -0.0005 0.0000
quadrupole: -7.1171 8.3945 -1.2774 5.4426 -0.0005 0.0000
hfenergy: -589.661891 hartree
pointgroup: C01 [X(C10H7N1O2)]
dipole: 2.8836062 -0.0086699 -0.0000243 debye
dipolederiv: -0.5946281 0.0966775 0.0000009 -0.1274473 -0.4646665 -0.0000048 -0.0000046 0.0000052 -0.1282116 -0.9023594 -0.497066 -0.0000048 -0.9896868 -1.1703052 -0.0000083 -0.0000103 -0.0000074 -0.2827663 -0.6143667 0.0504673 -0.0000382 0.1072165 -0.2245999 0.0000092 -0.0000002 0.000001 -0.2298129 -0.3480907 -0.1972959 -0.0000025 0.027682 -0.3267633 -0.000001 0.0000017 -0.0000028 -0.0145871 0.4795743 -0.092445 -0.000004 -0.135717 0.2455483 0.0000027 -0.0000087 0.0000021 0.0774355 0.6020588 0.2271354 0.0000016 0.9737342 1.2410874 0.0000092 0.0000136 0.0000071 0.1053517 0.3213005 -0.1650694 0.0000035 -0.0675353 -0.0057977 0.0000029 -0.0000154 0.0000024 -0.1511822 -0.3530341 0.0011596 0.0000017 0.0316738 -0.0461191 0.0000008 0.0000007 -0.0000004 -0.2042889 0.0126649 0.16942 0.0000018 -0.1853654 -0.5007237 -0.000002 -0.0000012 -0.0000028 -0.2242777 -0.3565316 0.1501727 0.0000037 -0.0291125 0.6709074 0.0000017 -0.0000115 -0.0000001 0.1297919 0.1741606 0.0905256 -0.0000003 0.2097761 0.2157822 0.0000021 0.0000042 0.0000024 -0.1364513 0.8346162 0.3945483 0.0000041 0.1593876 0.3105725 0.0000002 0.0000033 0.0000013 0.3184379 0.7323224 -0.0927582 0.0000336 -0.1457246 -0.0567531 -0.0000088 0.0000274 -0.0000053 0.0534836 0.1225489 0.005116 -0.0000005 0.0420384 0.0419425 -0.0000019 0.0000018 -0.0000006 0.1904801 0.0744461 -0.0597984 -0.0000005 -0.0252406 -0.013356 -0.0000013 -0.0000014 -0.0000013 0.1953484 -0.1017165 -0.0339471 -0.0000004 -0.0336284 0.0941669 -0.0000005 -0.0000008 0.0000006 0.175034 0.0117474 0.1029402 0.0000008 0.0856676 -0.0335258 -0.0000014 0.0000002 -0.0000009 0.159001 -0.078766 -0.0651625 0.0556689 0.0953782 0.0710235 -0.1049883 0.0977557 -0.0478186 -0.0794965 -0.0787638 -0.0651615 -0.055669 0.0953797 0.07102 0.1049927 -0.0977534 0.0478212 -0.0794941 0.0628169 -0.0194584 -0.0000003 -0.0884761 -0.1194404 -0.0000031 -0.0000011 -0.000003 0.1262046 unknown
polarizability: 206.0464988|-11.5468316|125.4762395|-0.0007496|0.0008427|51.7238995 unknown
InChI: InChI=1S/C10H7NO2/c1-12-9-3-2-4-10-8(9)5-7(6-11)13-10/h2-5H,1H3
charge 0 multiplicity 1
20 atoms
O  -1.640524 -1.100789 0.000004
O  2.117486 1.72218 0.000025
N  -4.538537 0.887073 0.000072
C  0.276438 0.200767 0.000013
C  -0.233581 -1.128622 0.000003
C  1.687445 0.395268 0.000014
C  -0.859122 1.088711 0.000025
C  0.566317 -2.28255 -0.000005
C  2.520678 -0.745836 0.000006
C  -1.993716 0.28748 -0.000009
C  1.957994 -2.055521 -0.000003
C  3.564911 1.9683 0.000036
C  -3.374923 0.601883 -0.000026
H  -0.841467 2.175534 0.000039
H  0.135547 -3.285845 -0.000011
H  3.609181 -0.642264 0.000008
H  2.636805 -2.914886 -0.000008
H  4.039687 1.545252 -0.905717
H  4.039677 1.545229 0.905784
H  3.668002 3.062637 0.00005
