program: Gaussian 09
title: 000215257
version: EM64L-G09RevD.01
frameworkgroup: C1[X(C11H14NS)]
method: RPBEPBE
basis: SDD
operation: Freq
keyword: #p
keyword: freq=noraman
keyword: PBEPBE/SDD
title: #p freq=noraman PBEPBE/SDD
converged: YES YES NO NO
title: Mulliken charges:
elementType: S N C C C C C C C C C C C H H H H H H H H H H H H H H
charge: 0.371872 -0.209199 -0.541717 -0.393866 -0.347884 -0.445588 0.636991 -0.568804 -0.361660 -0.323434 -0.259085 -0.221389 -0.209537 0.332816 0.284934 0.267032 0.263747 0.292547 0.272922 0.274460 0.292644 0.276145 0.258414 0.252462 0.274217 0.263905 0.267054
chargesum: 1.00000
title: Mulliken charges with hydrogens summed into heavy atoms:
elementType: S N C C C C C C C C C C C
charge: 0.371872 -0.209199 -0.208901 0.158100 0.208410 0.101793 0.636991 0.258399 -0.361660 -0.070972 0.015133 0.042516 0.057517
polarizability: 1.57432274e+02 4.54304979e+00 1.34863737e+02 8.22960120e+00 -1.18947908e+00 8.88909064e+01
1716.lowfreq: -10.9580 0.0012 0.0018 0.0019 8.4450 14.1923 51.3572 92.9152 128.8557
frequency: 50.8836 92.8953 128.8304 198.5854 218.9458 241.2174 266.5452 315.1178 326.7553 385.5085 439.0084 459.6786 482.3511 504.0663 522.0248 588.0044 631.1393 669.0794 686.7371 719.8225 734.8916 770.0536 800.8957 828.7431 871.3184 893.5950 909.0467 941.6833 956.8070 1004.4697 1006.6498 1013.7505 1022.6418 1026.0855 1072.4347 1096.3184 1126.8018 1132.1065 1144.0066 1168.9665 1181.6353 1188.8048 1218.2736 1233.5129 1260.6746 1275.2006 1293.5958 1310.7571 1334.0693 1349.9063 1386.2803 1428.1312 1440.4902 1450.5420 1462.9655 1469.9885 1473.6059 1481.7388 1490.3791 1580.9897 1605.0433 3022.4839 3042.8564 3044.9737 3049.3791 3090.8908 3102.6219 3118.1966 3129.7840 3139.9483 3143.9205 3148.1294 3160.5979 3173.3201 3187.1193
redmass: 2.3600 3.3193 3.0051 3.2175 1.3600 2.0834 2.9013 3.5609 3.2518 5.8498 3.3292 6.5777 4.9136 4.3307 3.6665 3.4223 2.9661 5.3653 3.7254 3.8971 3.8796 1.2960 2.4242 2.0652 1.3497 2.8016 1.8708 2.3098 1.3838 1.5859 2.6389 3.3595 5.0437 2.4650 1.8484 2.3817 1.4042 1.8544 1.6989 1.7252 1.2552 1.1169 1.3799 1.2142 1.2373 1.4379 1.3413 1.2540 1.3589 1.3360 8.4522 1.1868 2.1258 2.0956 1.0929 1.0535 1.0749 1.0785 1.0939 6.6233 7.3831 1.0318 1.0608 1.0617 1.0649 1.0912 1.1022 1.1034 1.1065 1.1057 1.0908 1.1050 1.0891 1.0946 1.1006
irintensity: 0.3507 0.6477 0.0996 2.3959 0.7368 0.3509 1.1564 1.5828 1.9599 2.2521 12.6102 0.2248 3.2015 1.6116 0.5427 10.6997 0.9290 6.4316 7.2446 8.4015 1.1801 72.5047 6.7691 2.4219 1.5060 14.2073 16.3205 5.8706 0.0743 2.8315 7.3455 3.1279 16.2736 3.1321 4.8792 3.6304 3.6933 2.9319 2.5228 4.6094 1.3594 0.6744 4.3377 1.2759 3.8890 4.6651 5.4321 9.3220 4.1487 1.5873 7.8597 15.1342 11.2377 41.9658 17.0852 28.5953 7.1558 38.1795 19.9108 9.5007 3.4806 3.6882 6.5847 9.2675 3.9215 1.2410 0.7068 4.7746 5.6759 3.9093 1.3789 1.3421 1.3820 0.4062 1.3770
temp: 298.150 k
press: 1.00000 atm
elementType: 16 7 6 6 6 6 6 6 6 6 6 6 6 1 1 1 1 1 1 1 1 1 1 1 1 1 1
symmnumber: 1
zpe: 597649.9 jmol-1
zpe.correction: 0.227633 hartree
zpe.thermalcorrener: 0.238850 hartree
zpe.thermalcorrenthalpy: 0.239794 hartree
zpe.thermalcorrgfe: 0.190666 hartree
zpe.sumelectzpe: -879.174869 hartree
zpe.sumelectthermal: -879.163651 hartree
zpe.sumelectthermalent: -879.162707 hartree
zpe.sumelectthermalfe: -879.211836 hartree
dipole: 2.7228 -3.0466 1.0742
dipole: 4.2248
quadrupole: -53.2031 -70.0946 -75.2141
quadrupole: -2.2411 3.4052 -2.1406
quadrupole: 12.9675 -3.9240 -9.0435 -2.2411 3.4052 -2.1406
hfenergy: -879.4025015 hartree
pointgroup: C01 [X(C11H14N1S1)]
dipole: 0.9613743 -1.3482477 -0.1443462 debye
polarizability: 156.110772|-3.4382147|126.0178822|13.5979786|17.2804909|99.0582634 unknown
InChI: InChI=1S/C11H14NS/c1-12-8-4-7-11(12)13-10-6-3-2-5-9(10)12/h2-3,5-6,11H,4,7-8H2,1H3
charge 1 multiplicity 1
27 atoms
S  0.52346 1.851069 1.408301
N  1.014825 -0.731631 0.538017
C  1.77702 0.626393 0.704298
C  1.824154 -1.445625 -0.564206
C  2.327793 0.962338 -0.70358
C  2.176871 -0.332699 -1.564861
C  -0.392657 -0.365662 0.115336
C  0.965305 -1.52815 1.841082
C  -0.78306 0.928554 0.516358
C  -1.276349 -1.246635 -0.528482
C  -2.091461 1.380981 0.25921
C  -2.589718 -0.791081 -0.792185
C  -2.990071 0.508756 -0.399773
H  2.56104 0.472111 1.461846
H  1.226723 -2.269031 -0.981911
H  2.718049 -1.864489 -0.071047
H  3.38176 1.274485 -0.616652
H  1.770532 1.799915 -1.149651
H  1.375302 -0.211168 -2.31115
H  3.102939 -0.583648 -2.105552
H  0.468586 -0.912387 2.606616
H  0.386832 -2.447766 1.669078
H  1.991324 -1.775886 2.154999
H  -0.976565 -2.256208 -0.829173
H  -2.407847 2.38456 0.557494
H  -3.29644 -1.450785 -1.303249
H  -4.008248 0.84919 -0.61106
