program: Gaussian 09
title: 000215236
version: EM64L-G09RevD.01
frameworkgroup: C1[X(C9H14N3)]
method: RPBEPBE
basis: SDD
operation: Freq
keyword: #p
keyword: freq=noraman
keyword: PBEPBE/SDD
title: #p freq=noraman PBEPBE/SDD
converged: NO NO NO NO
title: Mulliken charges:
elementType: N N N C C C C C C C C C H H H H H H H H H H H H H H
charge: -0.236933 -0.154469 -0.006277 -0.370833 -0.392647 0.232359 0.440816 -0.612805 -0.414810 0.237091 -0.746669 -0.760930 0.284683 0.284620 0.276782 0.276710 0.256973 0.288041 0.257074 0.273742 0.274952 0.260223 0.260957 0.259334 0.259180 0.272837
chargesum: 1.00000
title: Mulliken charges with hydrogens summed into heavy atoms:
elementType: N N N C C C C C C C C C
charge: -0.236933 -0.154469 -0.006277 0.198469 0.160844 0.232359 0.440816 0.189283 -0.141068 0.237091 0.049463 0.030421
polarizability: 1.55405778e+02 1.74716888e+00 1.29626514e+02 3.52592346e-03 -2.67880727e-02 6.65846965e+01
1716.lowfreq: -16.7823 -9.3629 -7.0141 0.0004 0.0008 0.0008 31.9822 47.9303 95.5653
frequency: 31.6937 46.6757 95.5493 108.0726 127.9528 150.2315 191.2955 212.5537 234.2638 269.1662 289.6501 340.9523 460.2508 500.6930 545.5879 560.6993 574.0310 612.7143 639.6320 752.5785 761.8589 848.0012 859.0839 916.0886 948.6611 965.9771 993.5999 1023.8620 1041.4212 1046.1384 1056.6278 1085.5159 1132.2206 1133.6603 1177.8271 1205.1464 1208.7776 1229.9970 1240.0437 1292.4412 1325.3594 1351.6123 1371.4693 1397.7617 1403.1277 1408.2170 1434.0871 1446.3154 1454.8515 1461.9995 1468.6332 1474.2889 1476.0924 1483.3068 1499.1700 1520.1030 1583.0075 1651.8716 2987.8697 2990.6496 2997.3547 3020.4368 3038.8094 3062.7967 3064.7967 3073.5931 3084.4338 3105.3080 3127.1429 3131.7663 3137.2120 3196.9659
redmass: 1.0395 1.7654 2.5678 1.1118 1.4771 1.7165 3.0440 2.8870 4.3246 2.5138 4.2712 2.7799 4.7635 4.5460 3.5450 4.2321 3.9652 3.3576 5.2513 5.4976 5.9831 1.2011 1.2354 4.0367 4.6120 1.9534 2.6976 1.5146 1.6686 1.5726 2.0692 1.4656 1.3799 6.5854 2.6619 1.1399 2.0896 1.0786 2.6060 3.9069 1.7965 1.5822 3.6052 1.3274 2.2448 1.2274 1.1930 1.2753 1.0451 1.0431 1.2291 1.0938 1.0410 1.1095 1.1426 3.4935 4.9724 6.4921 1.0406 1.0402 1.0347 1.0590 1.0597 1.0970 1.0957 1.1089 1.1031 1.1083 1.0973 1.1003 1.0985 1.0944
irintensity: 1.8235 0.1252 0.0307 0.8710 5.7260 6.0774 2.0357 0.8255 0.6209 0.1024 0.6610 3.7809 0.1416 0.0438 0.1613 1.2274 1.5643 7.9717 13.4025 5.4026 24.8646 0.4571 20.0052 4.7142 0.0345 6.7702 1.1048 1.0167 13.5379 4.9030 28.2063 0.0244 0.0372 6.2869 7.2205 3.7289 3.0342 0.1013 5.5625 21.2678 119.2363 6.0910 17.8156 109.7662 39.8931 19.1910 11.0773 89.9504 24.8891 24.1445 36.7524 14.6597 26.2337 2.8812 1.4039 120.4803 248.0184 584.4442 0.8747 2.6225 26.9246 25.0172 7.3639 2.6055 2.1827 4.7685 11.2772 6.0218 3.2133 0.2764 4.9329 1.4890
temp: 298.150 k
press: 1.00000 atm
elementType: 7 7 7 6 6 6 6 6 6 6 6 6 1 1 1 1 1 1 1 1 1 1 1 1 1 1
symmnumber: 1
zpe: 581035.8 jmol-1
zpe.correction: 0.221305 hartree
zpe.thermalcorrener: 0.233738 hartree
zpe.thermalcorrenthalpy: 0.234682 hartree
zpe.thermalcorrgfe: 0.181723 hartree
zpe.sumelectzpe: -514.499008 hartree
zpe.sumelectthermal: -514.486576 hartree
zpe.sumelectthermalent: -514.485631 hartree
zpe.sumelectthermalfe: -514.538591 hartree
dipole: 1.3645 3.2033 0.0008
dipole: 3.4818
quadrupole: -37.2614 -50.0049 -69.1651
quadrupole: 0.1308 -0.0002 -0.0070
quadrupole: 14.8824 2.1389 -17.0213 0.1308 -0.0002 -0.0070
hfenergy: -514.7203133 hartree
pointgroup: C01 [X(C9H14N3)]
dipole: -0.5475243 1.2555914 0.0126309 debye
dipolederiv: -0.889305 0.2138053 0.0307431 -0.6376402 -0.6222461 0.0298225 0.0370592 -0.0050638 -0.087201 -1.3492072 -0.2938072 0.0452402 -0.1075514 -0.38462 0.0048182 0.0443419 0.0128252 -0.2856682 -1.5396183 -0.2527415 0.0548416 0.4384102 -0.2863771 -0.0172596 0.0499963 0.0106104 -0.2312755 0.2272995 -0.2053404 0.002204 -0.0995205 0.176114 0.0043704 0.0010549 0.0088143 0.239432 0.3400856 -0.1632562 -0.0009633 -0.3776255 0.1557881 0.016566 0.000569 0.0078308 0.2909682 2.0149998 0.393567 -0.0752184 0.0523693 0.3591929 -0.0032573 -0.0730084 -0.0171119 0.2313574 0.7486883 -0.4631681 -0.0230897 0.2485918 0.8327145 -0.0148846 -0.0280207 0.0144407 0.0955089 0.1897274 0.2439867 -0.0003957 0.4151779 0.3348611 -0.0172186 -0.0021836 -0.0103898 0.2201532 -0.2734285 0.2744428 0.0025899 0.1028329 -1.1153042 0.0025193 0.0038088 -0.0041989 -0.1626461 1.2268349 0.0495122 -0.0454314 -0.204849 1.1304415 0.0015295 -0.0440548 -0.0085101 0.1224017 0.0089128 0.0866281 -0.0002117 -0.0651566 -0.3175747 0.0045756 0.0004152 -0.0046249 0.0136721 -0.4024647 0.3289098 0.0135198 0.1802503 -0.1369513 -0.006769 0.0165552 -0.0145201 -0.0248052 0.0625973 0.0139968 0.026202 0.0117469 0.030037 0.053211 0.0061028 0.0756699 0.0043755 0.0599276 0.0071457 -0.0306696 0.007437 0.027862 -0.0543183 -0.0104306 -0.0767631 0.0097481 0.0050796 0.015051 0.0544091 0.0513309 0.0815115 0.012822 0.1137596 -0.0118252 -0.0222634 -0.0088655 0.015118 -0.0557274 0.0481747 0.0816469 -0.0183277 -0.115517 0.0090283 -0.0080591 0.0275677 -0.0655285 0.0788555 -0.0572335 0.066672 -0.0445061 0.1149577 0.0242035 -0.0350259 0.0772112 0.0922045 0.0015073 0.024295 0.0601504 -0.0003178 0.0021816 -0.0030898 0.1402472 0.012196 -0.0685317 -0.0813645 -0.0558412 0.0666991 0.047403 -0.1177788 -0.0206182 -0.0201679 0.0339714 -0.0344493 0.0057789 -0.0403425 0.0901604 0.0023149 0.0059413 0.0021939 0.1712404 -0.0445578 -0.0426449 0.0088372 0.0430264 0.1139088 -0.0017696 0.0079669 0.0027249 0.1357965 0.0738542 0.0075357 -0.0978181 0.0086929 0.071399 0.0175831 -0.0755437 0.0446231 0.02214 0.0901674 0.0047204 0.090815 0.0078679 0.0704254 -0.0191418 0.0691605 -0.0444581 0.0079489 0.1216071 -0.0287012 0.0673535 0.0172029 0.0619436 0.056197 0.0754807 0.0314838 0.0126322 0.1083977 -0.0327183 -0.0752063 0.0106578 0.0601243 -0.0583395 -0.0848655 -0.0290366 0.0272709 0.0783215 -0.0957368 0.0031991 -0.0223045 -0.008579 0.0023776 0.0020515 0.0057615 0.1322192 unknown
polarizability: 155.2903812|-1.5423869|129.5955512|-3.5667228|-0.3697045|66.7310567 unknown
InChI: InChI=1S/C9H14N3/c1-7-6-8(2)12-5-4-11(3)9(12)10-7/h6H,4-5H2,1-3H3
charge 1 multiplicity 1
26 atoms
N  -0.240987 0.897345 0.056723
N  -1.86169 -0.67861 0.133944
N  0.422359 -1.437809 0.046929
C  -1.499839 1.699929 0.100609
C  -2.61592 0.604735 0.15547
C  -0.525234 -0.474539 0.078253
C  1.067466 1.346212 0.00092
C  -2.516504 -1.991449 0.169426
C  2.06816 0.365531 -0.031957
C  1.724044 -1.027898 -0.008186
C  1.319119 2.82557 -0.020405
C  2.783126 -2.090276 -0.044032
H  -1.580195 2.33243 -0.798012
H  -1.507606 2.348457 0.991341
H  -3.220924 0.675044 1.075588
H  -3.295105 0.661233 -0.712377
H  -3.111443 -2.100506 1.093212
H  -1.739878 -2.770379 0.145709
H  -3.180741 -2.115008 -0.703947
H  3.115232 0.668678 -0.076327
H  2.39787 3.032146 -0.073098
H  0.838528 3.307657 -0.89261
H  0.923776 3.318787 0.887789
H  3.398863 -2.002427 -0.958963
H  3.476025 -1.986123 0.812065
H  2.328199 -3.090333 -0.015266
