program: Gaussian 09
title: 000215294
version: EM64L-G09RevD.01
frameworkgroup: C1[X(C16H27NO2)]
method: RPBEPBE
basis: SDD
operation: Freq
keyword: #p
keyword: freq=noraman
keyword: PBEPBE/SDD
title: #p freq=noraman PBEPBE/SDD
converged: YES YES NO NO
title: Mulliken charges:
elementType: O O N C C C C C C C C C C C C C C C C H H H H H H H H H H H H H H H H H H H H H H H H H H H
charge: -0.286017 -0.287254 -0.065096 -0.284361 -0.038882 -0.432781 -0.399191 0.658031 -0.750478 -0.714482 -0.524211 -0.494157 -0.614646 -0.642886 0.208457 -0.346150 0.170014 -0.537560 -0.522735 0.227894 0.202016 0.201995 0.197627 0.195073 0.209709 0.243879 0.205688 0.206344 0.214132 0.223578 0.218165 0.226098 0.230453 0.217951 0.184163 0.223534 0.219220 0.181053 0.252298 0.247231 0.216333 0.228385 0.241828 0.256331 0.226449 0.206962
chargesum: 0.00000
title: Mulliken charges with hydrogens summed into heavy atoms:
elementType: O O N C C C C C C C C C C C C C C C C
charge: -0.286017 -0.287254 -0.065096 -0.056467 0.163134 -0.033159 0.005591 0.658031 -0.094568 -0.058607 -0.298112 -0.263704 0.011002 0.009685 0.208457 -0.098919 0.170014 0.148986 0.167006
polarizability: 2.37326174e+02 1.62252289e+00 1.61384577e+02 8.09985471e-01 1.18308475e+01 1.75156029e+02
1716.lowfreq: -3.7401 -0.0006 0.0005 0.0007 6.9606 12.4196 21.3763 40.9420 51.4219
frequency: 20.9687 40.8496 51.3498 53.5469 66.4420 78.6021 97.4396 108.3972 117.6155 136.7912 154.4772 180.7632 190.6434 199.9679 204.1891 213.6839 230.3636 235.2001 251.3817 265.7156 279.2583 288.2592 301.1689 330.4371 344.1239 357.1959 398.9899 433.7340 451.5364 466.4304 484.5051 497.1804 530.1952 550.9713 597.9975 641.6427 699.6220 723.1589 741.1281 778.6533 793.7473 821.1476 831.4042 859.0504 874.1937 918.9729 940.3449 960.7545 978.3915 980.3113 981.3102 1006.3223 1015.0525 1027.9472 1035.3812 1073.1626 1092.2421 1094.1979 1111.5647 1111.7756 1112.5431 1130.7307 1137.4614 1145.6180 1156.5141 1157.6373 1162.9770 1190.4410 1211.0363 1236.3539 1256.4088 1262.7079 1265.3012 1274.6531 1278.3873 1297.7529 1331.3462 1336.5155 1350.0179 1367.3700 1382.2002 1388.5065 1396.7656 1409.6045 1417.8197 1426.8534 1441.3784 1444.7361 1456.5386 1460.7200 1462.3052 1464.9623 1466.8911 1471.6055 1473.9001 1474.7334 1478.1887 1481.9712 1483.2346 1485.6553 1490.1627 1493.4198 1498.8974 1583.5791 1610.4798 2829.6640 2832.5803 2851.6050 2940.1377 2957.1416 2968.1619 2973.7299 2975.4998 2977.9451 2979.9811 2998.4907 3011.8554 3019.6689 3028.7992 3045.0346 3062.5823 3066.9452 3072.6372 3075.8304 3077.1174 3085.0385 3085.9480 3119.2071 3119.9919 3121.4500 3147.6463 3160.7663
redmass: 3.7967 3.8541 2.8733 2.8174 3.0526 2.6820 3.5397 2.7557 2.3714 2.4142 2.2412 1.4161 1.2454 1.6221 2.1915 2.0816 1.3073 1.1843 1.7858 1.7337 2.6646 2.7187 2.5690 3.1349 2.5568 2.5740 2.7785 2.7661 3.8577 2.5653 3.6331 2.8828 5.3096 3.9676 3.4700 3.7406 3.8610 4.2114 3.3975 1.2760 2.2500 2.6742 1.6946 1.7313 3.1758 1.7305 1.3788 8.2080 2.3284 2.4918 1.5783 2.0189 2.1790 1.7950 1.5801 2.1593 1.6858 1.6140 1.3932 1.7687 1.2707 1.5999 1.7691 1.7582 1.3720 1.7216 1.8007 1.9178 1.8873 1.4344 3.5206 2.2207 1.3538 1.4982 1.5052 1.4423 1.3873 1.7565 1.3570 1.3612 4.3420 1.2310 1.2426 1.8949 1.1432 1.1997 1.1640 1.3306 1.0702 1.0569 1.0651 1.0510 1.0505 1.0804 1.0979 1.0536 1.0537 1.0503 1.0556 1.0543 1.0503 1.0751 2.5549 7.5978 6.4329 1.0579 1.0663 1.0610 1.0802 1.0329 1.0353 1.0498 1.0444 1.0770 1.0482 1.0872 1.0708 1.0990 1.0707 1.1037 1.0991 1.0989 1.1009 1.0964 1.0995 1.1005 1.0982 1.0907 1.0979 1.1041 1.0890 1.0948
irintensity: 0.6882 0.3008 0.5581 0.4174 0.4638 2.9109 8.9933 0.6364 0.7219 0.3270 2.1659 2.7506 0.0941 0.9988 0.3932 0.1927 1.4480 0.0700 0.0957 0.6268 0.1652 5.1230 1.1717 2.6570 8.1438 2.2716 4.1049 2.7902 2.7719 2.0187 3.6293 0.3447 5.0235 2.2795 10.2568 16.6912 9.3814 5.0192 6.8032 17.8501 7.3624 33.9219 10.4734 15.0343 14.9208 6.8014 1.3613 42.6716 3.1896 12.6942 2.8182 19.3313 17.7458 24.9028 20.4135 14.0455 9.2682 21.7942 7.6084 54.8658 2.0310 7.1631 7.0314 17.0480 5.2148 15.9874 23.8554 1.9251 64.9937 20.7236 127.8087 19.8711 12.7504 3.3154 9.1581 0.3882 7.0656 31.4675 2.8594 11.7875 5.4792 12.0414 31.2740 18.3463 4.0909 3.3413 3.0039 12.4987 8.5404 8.9083 14.8197 14.3868 3.2783 11.0946 66.9297 2.4812 14.7515 27.2164 29.9776 20.3276 3.3812 3.2788 122.0347 14.5590 13.9462 76.6357 65.5900 305.0217 14.5656 56.3663 94.6219 36.7473 39.5991 1.8237 27.7482 67.6835 45.1667 25.7151 33.0179 44.0892 32.8095 79.8274 33.2212 39.9020 49.2491 37.7998 35.1170 34.4014 9.0984 22.6254 12.9570 7.1756
temp: 298.150 k
press: 1.00000 atm
elementType: 8 8 7 6 6 6 6 6 6 6 6 6 6 6 6 6 6 6 6 1 1 1 1 1 1 1 1 1 1 1 1 1 1 1 1 1 1 1 1 1 1 1 1 1 1 1
symmnumber: 1
zpe: 1047894.0 jmol-1
zpe.correction: 0.399122 hartree
zpe.thermalcorrener: 0.421574 hartree
zpe.thermalcorrenthalpy: 0.422518 hartree
zpe.thermalcorrgfe: 0.347269 hartree
zpe.sumelectzpe: -829.530392 hartree
zpe.sumelectthermal: -829.507940 hartree
zpe.sumelectthermalent: -829.506996 hartree
zpe.sumelectthermalfe: -829.582246 hartree
dipole: -1.9952 -0.1712 2.7682
dipole: 3.4165
quadrupole: -115.7914 -115.8403 -109.6607
quadrupole: -4.8660 8.4930 4.1570
quadrupole: -2.0273 -2.0761 4.1034 -4.8660 8.4930 4.1570
hfenergy: -829.9295142 hartree
pointgroup: C01 [X(C16H27N1O2)]
dipole: 0.7627828 -0.4629321 -1.0053099 debye
polarizability: 237.2362752|-3.2948693|155.4278413|0.5982667|-4.4241792|181.2026633 unknown
InChI: InChI=1S/C16H27NO2/c1-7-12(2)14(11-17(3)4)13-8-9-15(18-5)16(10-13)19-6/h8-10,12,14H,7,11H2,1-6H3
charge 0 multiplicity 1
46 atoms
O  -3.015308 0.089927 -1.413603
O  -3.968171 0.240605 1.261416
N  1.8865 2.121048 -0.337995
C  1.719577 -0.345674 0.302042
C  2.061321 -1.791471 -0.215195
C  2.288985 0.733999 -0.660987
C  3.571267 -2.007827 -0.539767
C  0.215268 -0.18232 0.531113
C  1.552233 -2.872348 0.769935
C  4.545037 -1.779559 0.639481
C  -0.686073 -0.142436 -0.563026
C  -0.314963 -0.096393 1.838323
C  2.296039 3.063417 -1.396799
C  2.324452 2.563525 0.998558
C  -2.077845 -0.012806 -0.365391
C  -1.708349 0.008254 2.04803
C  -2.605651 0.045767 0.962669
C  -2.494473 0.156833 -2.77952
C  -4.936825 -0.697804 0.660533
H  2.216804 -0.232186 1.286809
H  1.508708 -1.928988 -1.171192
H  3.406291 0.640375 -0.677085
H  1.939984 0.517887 -1.691612
H  3.68758 -3.050033 -0.901578
H  3.87072 -1.358997 -1.385867
H  0.457924 -2.815646 0.897668
H  2.008754 -2.753456 1.770875
H  1.805446 -3.883879 0.400418
H  5.58596 -1.985511 0.328894
H  4.315387 -2.443247 1.492465
H  4.509013 -0.735934 1.003781
H  -0.28706 -0.178775 -1.581972
H  0.360519 -0.126514 2.701859
H  1.864372 2.748302 -2.364434
H  3.407835 3.138015 -1.525479
H  1.912879 4.073191 -1.164286
H  2.009827 3.610296 1.157045
H  3.436177 2.509868 1.140453
H  1.843682 1.951716 1.780081
H  -2.131173 0.070245 3.055827
H  -1.971189 -0.778191 -3.061306
H  -1.809246 1.017576 -2.904265
H  -3.380116 0.291134 -3.418461
H  -4.931113 -0.622957 -0.439213
H  -5.914577 -0.393792 1.065315
H  -4.710612 -1.737539 0.969744
