program: Gaussian 09
title: 000215248
version: EM64L-G09RevD.01
frameworkgroup: C1[X(C13H17N3O3S)]
method: RPBEPBE
basis: SDD
operation: Freq
keyword: #p
keyword: freq=noraman
keyword: PBEPBE/SDD
title: #p freq=noraman PBEPBE/SDD
converged: YES YES NO NO
title: Mulliken charges:
elementType: S O O O N N N C C C C C C C C C C C C C H H H H H H H H H H H H H H H H H
charge: 0.191537 -0.307725 -0.304541 -0.289943 -0.328824 -0.066121 -0.090910 0.619682 0.027985 0.304660 0.265637 -0.576110 -0.544752 -0.339217 -0.126487 -0.353035 -0.652176 -0.523971 -0.527072 -0.524375 0.298489 0.256184 0.209293 0.254938 0.315921 0.261105 0.204506 0.216751 0.258442 0.232882 0.226831 0.249176 0.224929 0.230475 0.214467 0.262282 0.229084
chargesum: 0.00000
title: Mulliken charges with hydrogens summed into heavy atoms:
elementType: S O O O N N N C C C C C C C C C C C C C
charge: 0.191537 -0.307725 -0.304541 -0.289943 -0.012903 -0.066121 -0.090910 0.619682 0.027985 0.304660 0.265637 -0.277621 -0.288568 -0.339217 -0.126487 0.111196 0.030186 0.194184 0.177507 0.181458
polarizability: 3.59841486e+02 6.18249870e-02 1.93738446e+02 5.93224645e+00 2.29621171e+00 1.07925845e+02
1716.lowfreq: -10.9833 -6.6296 -2.3176 -0.0007 -0.0005 0.0021 23.7278 31.4983 47.1181
frequency: 23.6590 31.4835 47.1026 60.3125 62.2198 77.7527 81.6820 91.6346 94.9284 132.4812 148.4235 159.1761 162.0268 170.0723 193.7785 205.4004 217.7682 246.7446 251.3941 279.3146 311.1755 315.8829 334.7837 351.7066 368.1197 380.4181 433.7765 455.6608 484.7511 514.2517 551.1448 553.6818 586.4201 597.0383 625.4219 656.0918 664.0083 681.0767 724.7965 768.8003 800.7014 814.7746 864.6942 878.3166 887.1530 917.5070 932.3753 939.7299 1012.3712 1022.8412 1038.4026 1054.1629 1087.9346 1110.0621 1111.6647 1112.0262 1113.8130 1143.5187 1151.0296 1157.0956 1160.7146 1174.1162 1204.9997 1219.7257 1292.7523 1297.2184 1351.1582 1353.4457 1387.2751 1395.7003 1411.0544 1430.7411 1433.0859 1442.7355 1452.1409 1456.7051 1457.5501 1458.5942 1460.4664 1471.8317 1476.3057 1483.8411 1485.7284 1485.9761 1494.9373 1545.1884 1560.0187 1604.5583 2971.4990 2974.0778 2980.5493 2987.6462 3012.7269 3068.2230 3071.0513 3080.7755 3082.2055 3086.6620 3106.7521 3121.4677 3123.3938 3126.5188 3153.5673 3180.5468 3593.9217
redmass: 4.7675 4.0590 3.6777 3.2939 3.4030 3.0623 3.2264 3.0944 3.4783 2.2069 1.5566 1.1461 1.1525 2.2891 4.7047 2.7597 5.8348 2.9038 1.7720 5.4185 3.6047 3.6923 6.1638 5.8225 5.8052 1.4489 5.5035 3.6843 6.6610 5.8634 9.2088 7.6060 11.2363 6.4596 5.2735 5.7083 4.1493 3.7148 4.3013 3.9000 2.8680 2.0661 3.5723 2.1633 2.4647 1.6256 7.4064 9.0242 5.4506 4.5165 6.1840 3.0839 2.0887 1.2424 1.3481 1.4138 1.7777 1.9735 1.3692 1.5562 1.7846 2.8541 1.9392 1.6168 1.3215 4.3381 1.3403 4.8201 1.2111 3.0304 1.5384 1.4343 1.2336 1.7581 1.3724 1.1183 1.1192 1.1104 1.0916 1.0741 1.0584 1.0546 1.0575 1.0742 6.2651 5.4081 7.7224 6.7891 1.0308 1.0336 1.0296 1.0357 1.0608 1.1045 1.1024 1.0996 1.1047 1.0998 1.1024 1.1025 1.1036 1.1043 1.0916 1.0926 1.0781
irintensity: 1.4405 5.2479 2.1427 0.9909 2.6145 3.8678 3.4684 3.5718 6.6844 0.6014 2.7159 0.2310 0.2922 1.7925 3.2634 7.8177 2.1574 7.8368 7.8257 13.1412 15.3865 8.0127 0.2840 1.2135 1.6300 107.7974 2.0424 17.3497 8.8582 2.1259 0.1705 1.9088 3.1494 22.8900 20.7256 24.6116 27.6420 4.3215 20.3031 8.0306 5.4273 7.5708 8.1133 18.9449 1.3283 22.5875 96.3715 65.6952 127.4185 56.8033 106.5562 19.0932 31.0121 13.4768 5.1137 20.6669 3.3717 36.2316 3.3327 19.7805 19.8550 35.5035 10.8770 26.2969 175.1226 177.0207 64.1026 25.4887 22.7012 75.3936 37.7073 24.6587 37.4054 97.0378 20.8100 33.7043 28.2827 1.7643 1.1932 10.2542 3.0156 17.7378 14.9350 28.0762 36.8960 761.7697 93.7805 25.8394 65.1650 105.8327 72.4442 33.7661 61.5432 26.2172 6.6802 29.1574 23.6647 41.6264 35.3450 24.8902 26.2062 16.7891 2.6013 2.0719 98.0158
temp: 298.150 k
press: 1.00000 atm
elementType: 16 8 8 8 7 7 7 6 6 6 6 6 6 6 6 6 6 6 6 6 1 1 1 1 1 1 1 1 1 1 1 1 1 1 1 1 1
symmnumber: 1
zpe: 750158.4 jmol-1
zpe.correction: 0.285720 hartree
zpe.thermalcorrener: 0.307721 hartree
zpe.thermalcorrenthalpy: 0.308665 hartree
zpe.thermalcorrgfe: 0.232855 hartree
zpe.sumelectzpe: -1291.982944 hartree
zpe.sumelectthermal: -1291.960943 hartree
zpe.sumelectthermalent: -1291.959999 hartree
zpe.sumelectthermalfe: -1292.035809 hartree
dipole: -0.2689 2.4121 -0.8020
dipole: 2.5561
quadrupole: -77.8332 -126.2348 -124.1274
quadrupole: -13.6393 -2.1415 -0.6991
quadrupole: 31.5653 -16.8364 -14.7289 -13.6393 -2.1415 -0.6991
hfenergy: -1292.268664 hartree
pointgroup: C01 [X(C13H17N3O3S1)]
dipole: -0.1039647 -0.8425788 0.5390335 debye
polarizability: 359.5566635|-3.1529314|189.7608232|-9.8239935|-18.1676103|112.1882903 unknown
InChI: InChI=1S/C13H17N3O3S/c1-5-14-13-16-15-12(20-13)8-6-9(17-2)11(19-4)10(7-8)18-3/h6-7,14H,5H2,1-4H3
charge 0 multiplicity 1
37 atoms
S  -2.601786 -1.592844 0.656476
O  4.163331 -0.378565 -0.113868
O  2.763653 2.119994 -0.485901
O  2.598626 -2.730114 0.52021
N  -5.299911 -0.803128 0.672815
N  -2.256407 1.010807 0.116388
N  -3.638478 0.858148 0.214917
C  -0.081737 -0.17823 0.22697
C  2.759713 -0.294909 0.033446
C  2.064329 0.938755 -0.143122
C  2.014231 -1.46025 0.36912
C  0.664023 0.998268 -0.063789
C  0.607238 -1.395087 0.461723
C  -1.541585 -0.095639 0.296755
C  -4.00099 -0.409015 0.494922
C  -6.423087 0.149391 0.523039
C  -6.807612 0.408821 -0.948794
C  4.637419 -0.153891 -1.504358
C  3.701018 2.609345 0.551813
C  3.721168 -2.846495 1.47779
H  0.15142 1.949861 -0.225373
H  0.073683 -2.32003 0.70377
H  -7.280156 -0.261306 1.087682
H  -6.120327 1.097648 0.999606
H  -5.503707 -1.793639 0.793042
H  -5.950142 0.840739 -1.491456
H  -7.119158 -0.522297 -1.455677
H  -7.64618 1.12735 -0.999558
H  4.332347 0.846687 -1.858156
H  4.230692 -0.935882 -2.171264
H  5.734341 -0.230287 -1.454936
H  4.465784 1.846779 0.785197
H  3.143357 2.879559 1.468461
H  4.169363 3.507158 0.120691
H  3.374448 -2.600821 2.500255
H  4.55457 -2.185431 1.189519
H  4.025512 -3.903146 1.430944
