program: Gaussian 09
title: 000215200
version: EM64L-G09RevD.01
frameworkgroup: C1[X(C11H9NO3S)]
method: RPBEPBE
basis: SDD
operation: Freq
keyword: #p
keyword: freq=noraman
keyword: PBEPBE/SDD
title: #p freq=noraman PBEPBE/SDD
converged: YES YES NO NO
title: Mulliken charges:
elementType: S O O O N C C C C C C C C C C C H H H H H H H H H
charge: 0.243648 -0.254248 -0.438955 -0.257700 -0.035281 0.595372 0.155844 -0.456063 0.198753 -0.375248 -0.341509 -0.388553 0.097358 -0.489417 -0.203218 -0.524689 0.278316 0.283062 0.261733 0.269814 0.260812 0.283686 0.216272 0.234234 0.385976
chargesum: 0.00000
title: Mulliken charges with hydrogens summed into heavy atoms:
elementType: S O O O N C C C C C C C C C C C
charge: 0.243648 -0.254248 -0.052980 -0.257700 -0.035281 0.595372 0.155844 -0.177747 0.198753 -0.092186 -0.079776 -0.388553 0.097358 -0.219603 0.057594 0.209505
polarizability: 2.76602308e+02 5.09176260e+00 1.63752670e+02 1.41527058e+00 4.29864957e+00 6.57806485e+01
1716.lowfreq: -8.4386 -4.8096 0.0009 0.0010 0.0010 4.4295 32.3062 49.9601 74.7547
frequency: 32.2859 49.9556 74.7517 88.3552 115.0735 138.4933 181.8859 191.2813 222.6355 248.3020 277.1969 308.6818 353.4492 376.9806 412.5870 447.7508 491.5189 505.1848 559.0164 576.3241 592.6311 606.1630 633.1758 639.2686 694.2097 699.6484 724.8815 734.2800 765.4249 810.9786 844.9074 858.8392 874.2659 926.6017 947.6398 965.8092 994.8839 998.4492 1044.4778 1107.7568 1116.0177 1136.3597 1153.6730 1155.5292 1236.5654 1265.1587 1267.9487 1285.9481 1314.6271 1373.4368 1397.9200 1436.4908 1448.2036 1452.8564 1470.7618 1474.5275 1516.3162 1554.5812 1616.7577 1636.3420 2986.1881 3100.4944 3132.6782 3159.5575 3161.7636 3179.3075 3200.8525 3252.4550 3530.1156
redmass: 9.3152 5.4748 6.0426 7.3682 4.4713 4.1794 1.4164 7.2462 3.6955 7.9362 2.6206 8.0359 5.8945 7.1748 4.4686 4.4877 4.7361 4.5841 2.4379 10.2539 1.7799 3.9443 3.8911 6.0039 7.5407 5.3488 4.8233 1.3250 4.3274 7.1438 5.7704 1.4930 1.3345 1.5778 5.5523 8.4458 3.6339 1.3990 1.5792 1.4703 1.3890 1.6470 1.3791 1.4042 3.6116 2.9263 1.6395 1.6327 2.5220 3.6959 4.2805 1.5405 4.3465 1.1149 2.0123 1.2102 6.5309 7.5035 6.6794 7.6845 1.0326 1.0994 1.1057 1.0883 1.0913 1.0975 1.0920 1.1009 1.0642
irintensity: 0.3041 1.5630 1.1176 0.4743 0.9383 10.2743 1.8201 2.1843 7.1931 0.9553 3.3006 0.4926 6.2518 10.8941 7.8716 9.5422 4.5078 14.1068 9.3893 4.9942 73.3969 42.9834 80.3899 28.9604 9.7220 4.7907 5.5409 70.9046 8.7458 13.9581 2.6319 46.7706 2.1559 25.7598 95.0518 42.2174 161.4117 9.2281 9.6006 49.1346 51.6272 11.5958 89.4919 25.0446 165.9667 27.8017 3.9831 6.4745 98.2873 29.6736 57.6433 4.6810 7.2938 35.2430 181.5441 4.4344 8.3155 60.8708 11.1937 419.4038 62.1430 32.5848 10.5049 0.5650 4.6950 4.4636 10.1327 0.8439 47.1549
temp: 298.150 k
press: 1.00000 atm
elementType: 16 8 8 8 7 6 6 6 6 6 6 6 6 6 6 6 1 1 1 1 1 1 1 1 1
symmnumber: 1
zpe: 467317.8 jmol-1
zpe.correction: 0.177992 hartree
zpe.thermalcorrener: 0.192402 hartree
zpe.thermalcorrenthalpy: 0.193346 hartree
zpe.thermalcorrgfe: 0.135437 hartree
zpe.sumelectzpe: -1101.898781 hartree
zpe.sumelectthermal: -1101.884371 hartree
zpe.sumelectthermalent: -1101.883427 hartree
zpe.sumelectthermalfe: -1101.941336 hartree
dipole: 0.4451 1.2250 1.5643
dipole: 2.0361
quadrupole: -85.3353 -92.0009 -103.6817
quadrupole: 1.3503 -7.6887 -0.6104
quadrupole: 8.3374 1.6717 -10.0091 1.3503 -7.6887 -0.6104
hfenergy: -1102.0767731 hartree
pointgroup: C01 [X(C11H9N1O3S1)]
dipole: -0.1630778 0.4414986 -0.6482417 debye
dipolederiv: 0.0010515 -0.0925157 0.0199966 0.2585226 -0.4869555 0.1021684 -0.0486863 0.1155262 0.1051982 -1.9178875 0.4367325 0.2777405 0.3029094 -0.3668403 -0.0527819 0.1020856 0.0525747 -0.337895 -0.3370292 0.2583873 -0.026113 0.0297326 -1.1435873 0.2798531 0.0376511 0.3291359 -0.4839621 -1.1183108 -0.1443314 -0.210073 -0.2844002 -0.6036748 -0.0033972 -0.2205383 0.0158235 -0.4288194 -0.5259763 -0.1844265 0.0450735 -0.2445842 -0.5909553 0.0866135 0.0539776 0.0813872 -0.1966762 -0.1942043 -0.1143 0.0325033 0.0799471 -0.3906778 0.0267259 -0.0051774 0.0685925 0.0357474 -0.6759091 -0.3512751 0.0208032 0.0760979 -0.5722352 -0.002278 -0.0549014 0.0843018 -0.0540856 0.3601364 0.2747578 -0.0323536 -0.0253852 0.0101288 -0.0204343 0.0114055 0.0109232 -0.1008999 1.521306 -0.4763164 -0.1913744 -0.3904966 0.4181759 0.1210109 -0.0774316 -0.0503991 0.0880932 0.1792109 -0.0760511 -0.0250353 -0.182783 0.2238355 -0.0207345 -0.009254 -0.0408486 -0.0963786 -0.6205598 0.0888584 0.0630983 -0.2620999 0.121181 -0.0255376 0.176461 -0.1011272 -0.1720617 0.8219648 -0.1030757 -0.0188716 -0.3867609 0.8092967 -0.155724 0.0464013 -0.1649055 -0.0532907 1.394295 0.2771575 0.3540235 0.5925351 1.681441 -0.2976977 0.2933374 -0.3104758 0.4347111 -0.246964 0.2057963 -0.0360002 -0.0156626 0.0720351 -0.066635 0.0029512 -0.0760379 -0.2975002 0.1590313 0.067153 -0.0180322 0.2922718 0.0370814 -0.0339461 -0.062776 -0.0239489 -0.0716539 0.8158437 -0.10089 -0.1786925 0.2823448 0.1602565 -0.0678812 -0.3433319 0.0389569 0.357702 0.1161083 0.0733516 -0.0045658 0.0894704 0.0357614 0.008981 -0.0191718 0.0087114 0.1466585 0.077903 -0.0881158 0.02018 -0.0579571 0.0657631 0.0134678 -0.0057036 0.0278292 0.1469283 0.0640792 0.057377 -0.0041657 0.0483969 -0.0301518 0.0200791 0.0296184 0.0108147 0.1602219 0.0246642 0.0419001 -0.0015799 0.0288164 0.0903028 0.0247 0.0027989 0.0232707 0.2260071 -0.0147761 -0.0347032 0.012618 -0.1102891 0.0655928 0.0262662 0.0264462 0.0239064 0.1847744 0.0416557 -0.053397 -0.0068127 -0.1844844 0.0656983 -0.013206 -0.0093564 -0.0462497 0.0457482 -0.0243294 0.0534966 -0.0932207 -0.0509926 0.0486689 0.1140167 0.049331 0.0416439 -0.0843331 -0.0545454 0.085708 0.067263 0.144465 -0.0495363 -0.0509498 0.1242364 -0.0508172 0.0827413 0.1532421 -0.1012781 -0.0664093 -0.0296141 0.3293951 -0.0126793 -0.1003731 -0.0685883 0.3630247 unknown
polarizability: 275.1218216|-13.6386299|163.7300012|-5.4592216|-11.9459452|67.2838031 unknown
InChI: InChI=1S/C11H9NO3S/c1-15-9-3-2-7(6-8(9)11(13)14)10-12-4-5-16-10/h2-6,13H,1H3
charge 0 multiplicity 1
25 atoms
S  -3.020056 1.617389 -0.287654
O  3.092428 -1.655082 -0.066207
O  1.818332 2.581149 -0.591806
O  3.547568 1.391865 0.382216
N  -3.367225 -0.987611 0.201028
C  -0.959348 -0.414079 0.023988
C  1.425017 0.25831 -0.130167
C  0.034884 0.568996 -0.149744
C  1.815146 -1.117315 0.00227
C  -0.54641 -1.765784 0.237816
C  0.80869 -2.101076 0.219905
C  -2.390724 -0.104946 0.011207
C  2.381484 1.391203 -0.088513
C  -4.674281 0.952199 -0.116419
C  -4.63609 -0.410364 0.132168
C  4.156008 -1.062208 -0.90109
H  -0.239777 1.620771 -0.274932
H  -1.314275 -2.529954 0.390473
H  1.139673 -3.136737 0.33896
H  -5.539309 1.604548 -0.210014
H  -5.512852 -1.042947 0.27424
H  4.715554 -0.308347 -0.32805
H  3.726733 -0.599139 -1.809356
H  4.795608 -1.914801 -1.176549
H  2.474921 3.31606 -0.456872
