program: Gaussian 09
title: 000215217
version: EM64L-G09RevD.01
frameworkgroup: C1[X(C16H22O4)]
method: RPBEPBE
basis: SDD
operation: Freq
keyword: #pfreq=noraman
keyword: PBEPBE/SDD
title: #p freq=noraman PBEPBE/SDD
converged: NO YES NO NO
title: Mulliken charges:
elementType: O O O O C C C C C C C C C C C C C C C C H H H H H H H H H H H H H H H H H H H H H H
charge: -0.313159 -0.190868 -0.443079 -0.246459 0.299935 -0.421270 0.176033 -0.726173 -0.727801 -0.726274 -0.732678 -0.715990 0.193190 0.308483 0.136046 -0.353652 -0.307742 -0.203449 -0.233780 0.137593 0.219382 0.194953 0.211435 0.212173 0.208810 0.206472 0.204948 0.236109 0.212826 0.207362 0.229393 0.210022 0.225116 0.229447 0.256003 0.203409 0.231522 0.249742 0.281974 0.236915 0.237306 0.385772
chargesum: 0.00000
title: Mulliken charges with hydrogens summed into heavy atoms:
elementType: O O O O C C C C C C C C C C C C C C C C
charge: -0.313159 -0.190868 -0.057306 -0.246459 0.299935 -0.006935 0.176033 -0.093755 -0.080272 -0.076693 -0.068092 -0.025056 0.193190 0.308483 0.136046 -0.103910 -0.025767 0.033466 0.003526 0.137593
polarizability: 2.23769738e+02 1.04925840e+01 2.06579931e+02 1.14119394e+01 -1.77140447e+00 1.27745476e+02
1716.lowfreq: -16.8636 -13.5706 -11.0496 0.0001 0.0007 0.0008 19.9347 28.3126 37.3346
frequency: 17.6662 26.4792 37.1889 56.9836 76.2314 89.5486 118.8463 140.5791 155.7379 175.6541 203.3122 209.8043 222.6932 228.4005 230.8109 255.1689 259.2223 268.4090 276.1342 296.0733 317.4712 338.1180 345.8216 359.6298 386.0974 406.6194 412.0099 426.9229 440.2669 491.8838 501.7016 527.6646 567.6275 586.2855 603.5870 606.2697 682.5915 699.3719 712.3441 728.7639 740.9194 782.5617 789.9683 809.4264 845.6365 871.3583 888.7651 910.0511 922.2171 924.5800 936.0426 946.6637 972.0341 977.1309 990.2435 999.6407 1010.2554 1015.6979 1028.3514 1035.4797 1039.7421 1104.4529 1131.2587 1142.9494 1157.1367 1175.5460 1186.6246 1195.1807 1221.6532 1247.4557 1250.1113 1267.6299 1315.3022 1322.4222 1342.0270 1372.1163 1375.5958 1382.1684 1385.6825 1400.3691 1401.7161 1429.6126 1447.6055 1455.7524 1459.5946 1465.4547 1467.4290 1469.1945 1471.2166 1473.6571 1483.2540 1488.6975 1495.1607 1499.4073 1576.1394 1610.1620 1644.5995 1665.9823 2959.9367 2965.7469 2970.1849 2976.2412 2990.9366 2994.7824 3031.5791 3053.7010 3057.7236 3059.8056 3066.0991 3079.3984 3087.0033 3090.9933 3096.2290 3105.0949 3112.1800 3140.4301 3157.9912 3171.9521 3187.3769 3533.2981
redmass: 3.9919 2.9416 5.3072 7.2272 5.0953 5.2312 5.0524 5.6985 2.2281 2.7627 1.8843 1.9920 1.5815 1.2710 2.3303 1.7914 1.1487 1.4259 2.2531 2.2058 2.9992 4.9353 2.7073 2.5770 3.0188 4.7587 1.8586 3.1769 3.0850 4.3451 2.6885 4.1481 4.9789 1.2626 5.1271 4.6009 4.0409 5.1453 5.3247 4.0166 3.4172 2.6449 2.0696 4.3371 2.8155 2.0780 1.5281 2.2151 1.7043 1.6064 1.2663 1.5336 1.3883 1.7179 4.3895 1.3447 1.9046 1.6908 1.5592 1.5793 2.2404 2.0953 2.1391 1.7486 1.5798 1.1526 2.7076 2.5418 3.2069 3.2790 3.1185 1.5234 2.5264 1.5349 1.3151 1.2021 1.2095 1.1884 11.0004 1.1912 1.2127 2.2406 1.0730 1.0562 1.0556 1.0736 1.0925 1.0563 1.8329 1.1739 1.0543 1.0624 1.0646 1.0593 6.7822 6.8742 8.6694 11.5997 1.0361 1.0582 1.0364 1.0395 1.0356 1.0359 1.0989 1.0997 1.0998 1.0992 1.0984 1.0987 1.1002 1.0992 1.0969 1.0987 1.1002 1.0866 1.0914 1.0969 1.0969 1.0642
irintensity: 0.0455 0.0267 1.3285 0.5786 1.6137 1.6461 0.7163 0.9240 0.1548 0.2698 0.7248 0.2039 0.2341 0.8669 0.7657 1.1267 0.0939 0.8021 0.0674 0.2260 2.2192 6.4348 0.8783 0.8161 0.3695 5.8611 0.2664 10.4838 3.3686 5.2528 0.8472 15.6348 10.3944 102.3451 27.0114 3.6663 53.9892 6.0603 10.3892 13.0467 5.1165 4.8619 61.0665 9.1748 5.2932 17.7809 2.1017 20.7982 6.4151 10.2394 3.1913 2.8485 7.4257 32.5169 487.7707 1.0041 110.8968 83.6490 49.6879 55.3557 63.2450 73.3302 15.6518 20.4519 86.7966 3.2486 55.6356 2.9383 14.7198 3.3248 10.1426 6.3529 72.3457 3.7905 4.8752 10.8057 19.3862 21.1664 5.5305 18.8899 20.3502 18.2189 4.1403 3.8807 2.5645 4.9846 12.0133 8.7083 45.5824 34.3424 22.5336 6.7784 25.8985 26.1648 18.4395 26.1994 338.0576 124.6114 25.3385 38.0090 51.0254 16.2410 24.2542 30.9628 12.8750 1.7589 4.3151 58.2689 116.5762 22.3277 44.5370 36.2551 22.3631 27.7992 16.4296 2.8683 16.6898 8.9872 6.9784 50.4199
temp: 298.150 k
press: 1.00000 atm
elementType: 8 8 8 8 6 6 6 6 6 6 6 6 6 6 6 6 6 6 6 6 1 1 1 1 1 1 1 1 1 1 1 1 1 1 1 1 1 1 1 1 1 1
symmnumber: 1
zpe: 907916.3 jmol-1
zpe.correction: 0.345807 hartree
zpe.thermalcorrener: 0.367365 hartree
zpe.thermalcorrenthalpy: 0.368309 hartree
zpe.thermalcorrgfe: 0.295101 hartree
zpe.sumelectzpe: -922.284089 hartree
zpe.sumelectthermal: -922.262531 hartree
zpe.sumelectthermalent: -922.261587 hartree
zpe.sumelectthermalfe: -922.334795 hartree
dipole: 0.6000 1.5320 -1.0455
dipole: 1.9494
quadrupole: -105.1778 -108.3013 -127.4768
quadrupole: 1.6975 1.4251 -0.1483
quadrupole: 8.4742 5.3507 -13.8249 1.6975 1.4251 -0.1483
hfenergy: -922.629896 hartree
pointgroup: C01 [X(C16H22O4)]
dipole: -0.2658518 -0.5233783 -0.4935551 debye
polarizability: 223.3863756|12.3505404|203.4694552|-12.8883024|13.9939517|131.2393142 unknown
InChI: InChI=1S/C16H22O4/c1-15(2,3)10-16(4,5)14(19)20-12-9-7-6-8-11(12)13(17)18/h6-9,17H,10H2,1-5H3
charge 0 multiplicity 1
42 atoms
O  -0.19118 -0.005198 -0.588937
O  0.1147 0.606344 1.649284
O  -3.806284 1.953136 0.955105
O  -1.714156 2.353688 0.055099
C  3.480241 -0.87781 -0.11796
C  2.703662 0.279584 -0.837271
C  1.798584 1.305524 -0.059633
C  3.926013 -1.861607 -1.240108
C  4.762391 -0.367463 0.596525
C  2.597039 -1.655786 0.893507
C  2.504679 2.016645 1.120019
C  1.348557 2.384802 -1.098228
C  0.527146 0.635559 0.478868
C  -1.434472 -0.633936 -0.334036
C  -2.593362 0.056898 0.127887
C  -1.487769 -2.013493 -0.624083
C  -3.789716 -0.690985 0.312822
C  -2.688763 -2.730489 -0.449653
C  -3.843327 -2.068201 0.03053
C  -2.606067 1.525591 0.357079
H  2.056234 -0.178301 -1.609949
H  3.454038 0.888845 -1.383567
H  4.542801 -2.679415 -0.821603
H  4.52841 -1.342182 -2.010069
H  3.051285 -2.315555 -1.743614
H  5.343696 -1.222535 0.991662
H  5.413226 0.185616 -0.107861
H  4.532946 0.299836 1.442921
H  1.66296 -2.012658 0.419874
H  3.143237 -2.541712 1.269221
H  2.319726 -1.040181 1.767297
H  3.46965 2.433319 0.78129
H  2.686599 1.338117 1.969041
H  1.876647 2.844772 1.492807
H  0.598048 3.064359 -0.66223
H  2.231833 2.973344 -1.407693
H  0.902112 1.914685 -1.990299
H  -0.57853 -2.505161 -0.982719
H  -4.67432 -0.161584 0.675031
H  -2.7196 -3.800932 -0.679285
H  -4.776538 -2.620841 0.17785
H  -3.757776 2.939061 1.07598
