program: Gaussian 09
title: 000215215
version: EM64L-G09RevD.01
frameworkgroup: C1[X(C19H24O2)]
method: RPBEPBE
basis: SDD
operation: Freq
keyword: #pfreq=noraman
keyword: PBEPBE/SDD
title: #p freq=noraman PBEPBE/SDD
converged: NO YES NO NO
title: Mulliken charges:
elementType: O O C C C C C C C C C C C C C C C C C C C H H H H H H H H H H H H H H H H H H H H H H H H
charge: -0.320692 -0.213263 0.298537 -0.404293 0.155746 -0.728152 -0.728127 -0.726812 -0.721850 -0.716868 0.179850 0.278716 0.102974 0.429251 -0.351629 -0.360659 -0.457327 -0.226741 -0.421761 -0.237629 -0.238560 0.209023 0.193479 0.212338 0.209692 0.216942 0.208305 0.204733 0.234344 0.224310 0.209111 0.223273 0.209971 0.226575 0.224822 0.224476 0.218355 0.235324 0.304288 0.255273 0.238946 0.229400 0.239045 0.228644 0.228624
chargesum: 0.00000
title: Mulliken charges with hydrogens summed into heavy atoms:
elementType: O O C C C C C C C C C C C C C C C C C C C
charge: -0.320692 -0.213263 0.298537 -0.001791 0.155746 -0.089181 -0.080746 -0.070118 -0.060483 -0.038714 0.179850 0.278716 0.102974 0.429251 -0.047341 -0.105386 -0.218381 0.002660 -0.182716 -0.008985 -0.009936
polarizability: 2.64382032e+02 -1.81658071e+01 2.27104613e+02 1.56133029e+01 2.95506161e+01 1.54465708e+02
1716.lowfreq: -12.2672 -4.9370 -0.0006 -0.0005 0.0002 5.7949 16.7080 25.5636 44.0913
frequency: 10.2221 25.5313 44.0823 64.9739 82.7540 100.1398 146.0168 172.9627 175.5939 192.9801 209.8932 214.0670 221.1248 238.4437 247.7332 265.5866 274.9550 276.2507 284.7578 301.8962 330.7767 348.2050 369.1668 390.8183 412.7589 419.9884 426.2344 439.8385 468.9609 501.8770 509.5634 514.0944 568.9104 577.4854 617.5182 637.7965 704.8240 713.8621 737.4621 748.9872 766.6825 785.5607 786.7529 815.4131 827.4729 865.6690 880.4613 883.6394 911.9875 925.8589 927.0279 927.2976 939.1519 944.1785 967.7477 977.2453 986.5768 995.2009 1004.9516 1014.6703 1022.1367 1030.0434 1032.2109 1056.3121 1087.0731 1131.5492 1144.0497 1146.5970 1171.7060 1181.2554 1200.2653 1211.7927 1225.8300 1237.2603 1249.1200 1251.9112 1263.0835 1324.9904 1342.1744 1372.9108 1373.5375 1377.5034 1378.9281 1399.2227 1402.7611 1404.9887 1421.5090 1439.8898 1448.9150 1450.0298 1457.7669 1461.7456 1467.1528 1469.0987 1470.7145 1476.3277 1481.9489 1488.4876 1497.3298 1499.6513 1512.3502 1577.1394 1596.8118 1627.5643 1637.7328 2961.9664 2967.4603 2971.6846 2977.2103 2981.4982 2995.3721 3033.8986 3054.9311 3060.2265 3061.9785 3068.9255 3077.5615 3077.9198 3088.2280 3094.8286 3097.4876 3107.3170 3123.7480 3129.9775 3136.7781 3155.3284 3157.0857 3174.9258 3213.5098
redmass: 4.3120 4.2859 2.6955 6.9258 4.4271 4.1458 3.8359 1.9329 3.9541 3.0236 1.4290 2.9007 2.9297 1.0525 1.4030 1.1663 1.1853 3.1720 2.5215 1.9062 3.5595 2.6258 2.4597 2.8692 2.0483 3.1235 3.2648 2.6928 3.3256 3.3003 4.5981 6.2288 3.4012 4.8594 5.0480 3.4833 5.8657 5.9971 3.7862 1.3318 7.0396 2.3653 3.7823 1.5208 2.9022 2.6071 2.4851 1.6441 2.2201 1.3863 1.5824 1.7451 1.2930 1.4188 1.3720 1.7476 1.3480 1.3383 1.5663 2.6456 1.6592 1.9077 1.4946 2.8348 2.6883 2.1252 1.6841 1.5512 1.0838 1.3360 2.5979 1.9549 3.3054 1.9436 3.2773 3.1251 1.6750 1.5347 1.3239 1.4353 1.6129 1.2100 1.2051 1.2127 3.1714 1.2413 4.5897 2.7062 2.4135 1.0822 1.0549 1.0520 1.0497 1.0554 1.0515 1.0513 1.0571 1.0626 1.0647 1.0566 3.8000 7.3518 5.7083 9.4063 7.7380 1.0368 1.0576 1.0366 1.0395 1.0347 1.0363 1.0980 1.0996 1.0993 1.0994 1.0984 1.1003 1.0992 1.1000 1.1004 1.0964 1.0981 1.0862 1.0872 1.0901 1.0969 1.0963 1.0969 1.0940
irintensity: 0.1406 0.3208 0.0041 0.1972 0.8405 1.0359 0.6524 0.8576 2.3904 0.0812 0.2398 0.7236 1.3055 0.1724 0.7481 0.1712 0.6742 0.5417 0.7073 0.3517 8.2797 3.2702 0.9009 0.8383 0.3633 6.0301 3.2739 1.4774 0.0099 0.6976 0.3361 0.0357 10.0249 5.1911 2.5332 0.6915 4.6898 2.9100 0.0481 1.2428 2.4832 46.7189 18.0821 86.1311 3.2685 4.3193 4.8618 7.8443 7.4054 1.2318 2.0627 3.7001 2.2362 1.7125 0.7972 11.0326 5.6593 0.2458 31.7073 10.3386 42.4946 8.0966 0.5412 332.6315 327.1087 47.7450 31.0246 4.4072 0.8782 44.9329 0.6163 28.6170 23.4359 6.6661 0.3007 13.8802 5.6648 4.5359 5.6719 20.6805 23.8856 17.7976 21.7430 33.3483 23.4238 15.0140 12.4062 7.2410 20.1589 3.2853 4.5702 1.8978 1.2912 4.5386 5.6106 12.5702 18.5384 2.7526 29.7994 22.6750 18.1844 33.3368 7.4692 129.1013 41.6805 20.9674 37.3737 47.5611 17.3506 25.5230 28.9078 19.7143 4.3114 55.6549 8.0953 104.2793 16.6358 28.4407 59.9747 24.7172 29.9250 24.6127 0.9148 2.3998 14.1845 30.3566 33.8765 15.4901 3.1436
temp: 298.150 k
press: 1.00000 atm
elementType: 8 8 6 6 6 6 6 6 6 6 6 6 6 6 6 6 6 6 6 6 6 1 1 1 1 1 1 1 1 1 1 1 1 1 1 1 1 1 1 1 1 1 1 1 1
symmnumber: 1
zpe: 995256.3 jmol-1
zpe.correction: 0.379073 hartree
zpe.thermalcorrener: 0.400253 hartree
zpe.thermalcorrenthalpy: 0.401198 hartree
zpe.thermalcorrgfe: 0.328732 hartree
zpe.sumelectzpe: -887.319358 hartree
zpe.sumelectthermal: -887.298178 hartree
zpe.sumelectthermalent: -887.297233 hartree
zpe.sumelectthermalfe: -887.369699 hartree
dipole: -0.0921 1.7620 0.7615
dipole: 1.9217
quadrupole: -113.5750 -126.6493 -126.9399
quadrupole: 1.9264 5.4052 2.8112
quadrupole: 8.8131 -4.2612 -4.5518 1.9264 5.4052 2.8112
hfenergy: -887.698431 hartree
pointgroup: C01 [X(C19H24O2)]
dipole: -0.0500169 0.3162185 -0.684937 debye
polarizability: 255.0069918|31.7356429|163.6900644|24.9301883|-27.4110995|227.2552969 unknown
InChI: InChI=1S/C19H24O2/c1-18(2,3)13-19(4,5)17(20)21-16-12-8-10-14-9-6-7-11-15(14)16/h6-12H,13H2,1-5H3
charge 0 multiplicity 1
45 atoms
O  0.166526 0.40602 0.712968
O  1.353985 -0.146773 2.663725
C  3.384466 -0.386569 -0.953135
C  2.691383 0.962375 -0.547544
C  2.390059 1.331939 0.948092
C  3.138334 -0.556866 -2.481576
C  4.921565 -0.343628 -0.726003
C  2.781014 -1.61325 -0.220249
C  3.628988 1.289656 1.874136
C  1.815182 2.788565 0.95038
C  1.297726 0.434113 1.560174
C  -1.051671 -0.292441 0.959195
C  -1.988838 -0.188338 -0.131478
C  -3.267835 -0.854234 0.003518
C  -1.349484 -1.010354 2.121732
C  -1.703765 0.540853 -1.332016
C  -3.559799 -1.586466 1.201738
C  -2.620267 -1.658258 2.229453
C  -4.211686 -0.761983 -1.072602
C  -2.645959 0.610627 -2.361553
C  -3.910784 -0.045519 -2.232589
H  1.723784 1.013919 -1.082711
H  3.314426 1.78827 -0.950806
H  3.664352 -1.45105 -2.865733
H  3.507816 0.321825 -3.044667
H  2.059998 -0.675251 -2.699723
H  5.388089 -1.268828 -1.11493
H  5.376056 0.512454 -1.260986
H  5.18859 -0.259028 0.340069
H  1.687611 -1.674869 -0.373674
H  3.227213 -2.546158 -0.613797
H  2.976339 -1.588268 0.866807
H  4.452938 1.871263 1.423699
H  3.976668 0.259763 2.053746
H  3.387653 1.725984 2.859156
H  1.503356 3.091946 1.966525
H  2.598837 3.489887 0.609867
H  0.9453 2.877753 0.277552
H  -0.623536 -1.077374 2.931366
H  -0.736665 1.041825 -1.425764
H  -4.530064 -2.08724 1.296246
H  -2.844012 -2.218038 3.143789
H  -5.179145 -1.267168 -0.966994
H  -2.417982 1.170993 -3.274928
H  -4.640358 0.017322 -3.047374
