program: Gaussian 09
title: 000012464
version: EM64L-G09RevD.01
frameworkgroup: C1[X(C6H4Cl3N)]
method: RPBEPBE
basis: SDD
operation: Freq
keyword: #p
keyword: freq=noraman
keyword: PBEPBE/SDD
title: #p freq=noraman PBEPBE/SDD
converged: NO NO NO NO
title: Mulliken charges:
elementType: Cl Cl Cl N C C C C C C H H H H
charge: -0.017818 0.021749 -0.013383 -0.689003 0.631124 -0.293407 -0.405611 -0.041053 -0.184776 -0.134741 0.232157 0.254950 0.316478 0.323333
chargesum: 0.00000
title: Mulliken charges with hydrogens summed into heavy atoms:
elementType: Cl Cl Cl N C C C C C C
charge: -0.017818 0.021749 -0.013383 -0.049192 0.631124 -0.293407 -0.173453 -0.041053 0.070174 -0.134741
polarizability: 1.41340682e+02 -4.46638801e+00 1.17767461e+02 -1.36172153e-03 4.45691564e-03 3.71662749e+01
1716.lowfreq: 0.0024 0.0025 0.0037 5.0564 5.3530 11.6565 80.5908 116.0750 191.0097
frequency: 80.5876 116.0686 191.0082 203.7644 223.2495 282.7050 305.0991 327.6444 393.1788 399.3801 458.3360 464.6561 490.8800 496.9169 577.1238 656.9734 714.0821 735.6424 798.9244 887.1449 927.6115 1012.1087 1074.4977 1147.3938 1169.1943 1325.7813 1360.2904 1388.9260 1467.7014 1551.2186 1603.9658 1636.7464 3142.6493 3169.5419 3555.6406 3702.1868
redmass: 23.9446 5.6041 26.7819 30.6055 6.0738 4.9867 4.8706 26.9335 9.4418 1.1752 1.1368 10.0646 4.1009 3.6022 4.8906 8.2018 4.6115 9.7450 1.5695 5.9505 1.3451 2.8389 2.3013 1.6290 1.6875 2.3785 5.4006 5.6489 4.2345 7.4719 3.0650 1.4881 1.0887 1.0965 1.0453 1.1040
irintensity: 0.0602 0.8496 0.0057 0.1064 10.2984 3.5637 7.4460 0.4632 4.2017 111.2146 187.2983 8.7115 7.5225 0.1557 1.6308 25.7321 0.0436 48.4689 61.4524 24.4828 0.1455 2.7431 32.5382 24.4189 5.4645 11.3642 35.1233 7.2156 194.6401 4.7359 13.6164 284.9838 8.5290 4.1779 89.7929 37.6692
temp: 298.150 k
press: 1.00000 atm
elementType: 17 17 17 7 6 6 6 6 6 6 1 1 1 1
symmnumber: 1
zpe: 227522.7 jmol-1
zpe.correction: 0.086659 hartree
zpe.thermalcorrener: 0.096297 hartree
zpe.thermalcorrenthalpy: 0.097241 hartree
zpe.thermalcorrgfe: 0.050932 hartree
zpe.sumelectzpe: -1665.246278 hartree
zpe.sumelectthermal: -1665.236641 hartree
zpe.sumelectthermalent: -1665.235696 hartree
zpe.sumelectthermalfe: -1665.282006 hartree
dipole: -3.4549 3.5715 0.0019
dipole: 4.9691
quadrupole: -70.2798 -69.6319 -81.8765
quadrupole: -5.4753 -0.0063 0.0041
quadrupole: 3.6496 4.2975 -7.9471 -5.4753 -0.0063 0.0041
hfenergy: -1665.3329371 hartree
pointgroup: C01 [X(C6H4Cl3N1)]
dipole: 1.5572718 -1.1818992 0.000745 debye
dipolederiv: -0.3080155 -0.2849017 -0.0000158 -0.2946206 -0.473039 -0.0000063 -0.0000075 -0.0000202 -0.0263466 -0.1640339 0.2418716 -0.0000179 0.2772941 -0.5036687 0.0000342 -0.000009 0.0000324 -0.0107774 -0.7484129 -0.0507155 -0.0000121 -0.0313492 -0.0734299 0.0000022 -0.0000144 0.0000078 -0.0294274 -1.5654535 0.1386729 0.000248 0.0772584 -0.1487777 -0.0001224 0.0006788 -0.0002109 -0.7141588 1.5210684 -0.2681284 -0.0001518 -0.1919238 -0.1655076 0.0000287 -0.0000792 0.0000502 0.1764955 -0.0730752 0.3165081 0.0000491 0.8783403 0.5072618 0.0000224 -0.0000463 0.0000201 -0.1184695 -0.292782 0.2257467 0.000005 -0.299196 0.0763762 -0.0000179 0.0000323 -0.0000073 -0.2342782 0.2399378 -0.2215556 -0.000016 -0.4445772 0.734569 -0.0000556 -0.0000008 -0.0000558 0.0224074 -0.0195198 -0.2597707 -0.0000055 0.0006863 0.1385536 -0.0000181 -0.000012 -0.0000143 -0.0633006 0.8501391 0.1668566 0.0000288 0.0512004 -0.3476292 0.0000087 0.0000263 0.0000038 -0.115092 -0.0087527 0.086433 -0.0000115 0.0653182 -0.0497673 0.0000262 0.0000029 0.0000195 0.1772809 0.0569776 -0.0624339 0.0000005 -0.0573601 -0.0051866 0.0000137 0.0000024 0.0000142 0.1631462 0.2444869 -0.0242174 -0.0000472 -0.0511789 0.1303616 0.0000991 -0.0003054 0.0001872 0.3897846 0.267436 -0.0043659 -0.0000536 0.0201079 0.1798837 -0.0000149 -0.0002681 -0.0000266 0.3827358 unknown
polarizability: 142.1383246|-0.7137194|116.9698187|0.0020241|-0.0041978|37.1662749 unknown
InChI: InChI=1S/C6H4Cl3N/c7-3-1-2-4(10)6(9)5(3)8/h1-2H,10H2
charge 0 multiplicity 1
14 atoms
Cl 1.736826 2.168778 0.000044
Cl -1.498559 2.291014 -0.000116
Cl -3.211949 -0.491666 -0.00002
N  2.840832 -0.642699 -0.000016
C  1.454217 -0.601645 0.000036
C  0.755555 0.642994 -0.000002
C  0.676323 -1.796566 0.00015
C  -0.65727 0.695539 -0.000031
C  -0.727484 -1.74593 0.000114
C  -1.402402 -0.506797 0.000013
H  1.184036 -2.766957 0.00025
H  -1.312014 -2.670859 0.000187
H  3.326862 -1.534235 0.000604
H  3.380527 0.219231 0.000287
