program: Gaussian 09
title: 000012463
version: EM64L-G09RevD.01
frameworkgroup: C1[X(C6H2Cl4)]
method: RPBEPBE
basis: SDD
operation: Freq
keyword: #pfreq=noraman
keyword: PBEPBE/SDD
title: #p freq=noraman PBEPBE/SDD
converged: NO NO NO NO
title: Mulliken charges:
elementType: Cl Cl Cl Cl C C C C C C H H
charge: 0.046505 0.046537 0.014681 0.014663 -0.034725 -0.034781 -0.093828 -0.093803 -0.201249 -0.201256 0.268629 0.268628
chargesum: 0.00000
title: Mulliken charges with hydrogens summed into heavy atoms:
elementType: Cl Cl Cl Cl C C C C C C
charge: 0.046505 0.046537 0.014681 0.014663 -0.034725 -0.034781 -0.093828 -0.093803 0.067380 0.067372
polarizability: 1.46437069e+02 1.20065912e-04 1.15756560e+02 -7.02530281e-04 -1.12863749e-03 3.58043498e+01
1716.lowfreq: -3.2254 -0.0015 0.0009 0.0032 5.8600 11.3843 76.5523 89.8727 192.4283
frequency: 76.5509 89.8702 192.4283 196.1906 207.9277 229.8032 288.2568 316.1947 333.3079 454.0500 474.4234 505.4688 547.0663 569.8625 704.9907 732.0544 782.5680 802.1571 938.5476 1011.6637 1125.6575 1160.6000 1166.6485 1340.8169 1344.3244 1409.1797 1549.2112 1560.5404 3166.1696 3184.2678
redmass: 32.5864 10.8390 30.8622 25.5112 32.4070 6.8125 7.4866 28.2737 27.5506 5.8700 12.3672 4.5196 5.8474 11.9483 7.7066 9.3817 9.2528 1.3326 1.3362 10.1719 2.9746 1.8315 1.8950 4.3449 10.9205 2.4917 8.5639 7.4833 1.0887 1.0978
irintensity: 0.0000 0.5864 0.0368 0.1067 0.0011 4.2098 0.0000 0.0756 0.1086 5.0354 8.8069 0.0000 6.5126 27.0020 0.0000 41.2915 41.2840 46.4857 0.0000 17.7357 4.5148 11.6522 55.6589 46.0795 9.4321 131.0619 2.2009 8.5685 0.0681 0.1331
temp: 298.150 k
press: 1.00000 atm
elementType: 17 17 17 17 6 6 6 6 6 6 1 1
symmnumber: 1
zpe: 158270.7 jmol-1
zpe.correction: 0.060282 hartree
zpe.thermalcorrener: 0.069711 hartree
zpe.thermalcorrenthalpy: 0.070655 hartree
zpe.thermalcorrgfe: 0.023901 hartree
zpe.sumelectzpe: -2069.349582 hartree
zpe.sumelectthermal: -2069.340153 hartree
zpe.sumelectthermalent: -2069.339209 hartree
zpe.sumelectthermalfe: -2069.385963 hartree
dipole: 0.0000 -2.4115 0.0000
dipole: 2.4115
quadrupole: -88.3607 -77.1070 -86.0804
quadrupole: -0.0005 0.0000 -0.0001
quadrupole: -4.5114 6.7424 -2.2310 -0.0005 0.0000 -0.0001
hfenergy: -2069.409864 hartree
pointgroup: C01 [X(C6H2Cl4)]
dipole: -0.0000302 -0.9487546 0.0000011 debye
dipolederiv: -0.1873725 -0.2687511 0.0000063 -0.2976823 -0.4640853 0.000012 0.0000134 0.0000242 0.0074912 -0.1873062 0.2687289 -0.0000025 0.2976614 -0.4641156 0.000005 -0.0000015 -0.0000013 0.0075159 -0.7417983 0.0743465 0.0000118 0.0493878 -0.0610747 -0.000001 0.0000212 -0.0000002 -0.0167956 -0.741824 -0.0742949 0.0000049 -0.0493355 -0.0610778 0.0000004 -0.0000059 -0.0000028 -0.0168095 0.0257656 0.5311532 -0.0000115 0.5252321 0.5825017 -0.0000265 -0.0000113 -0.0000411 -0.0159853 0.0256748 -0.5311002 0.0000064 -0.525195 0.5825768 0.0000003 0.0000039 0.0000127 -0.0160059 1.0573962 -0.2134721 -0.0000158 -0.1090411 -0.0797281 0.0000041 -0.0000326 0.0000093 -0.0497972 1.0574393 0.2133628 -0.0000039 0.1089633 -0.0797402 0.0000024 0.0000062 0.000003 -0.049783 -0.2020752 0.0445215 0.0000022 -0.0184571 0.0071761 0.0000086 0.0000069 0.0000063 -0.0956236 -0.2020931 -0.0444922 0.0000013 0.0184695 0.007178 -0.0000061 -0.0000027 -0.0000107 -0.0956288 0.0480981 0.0450069 0. 0.0390876 0.0151894 -0.0000009 0.0000017 -0.0000074 0.1707107 0.0480953 -0.0450094 0.000001 -0.0390908 0.0151997 0.0000017 0.0000008 0.000008 0.170711 unknown
polarizability: 146.4370685|-0.0010075|115.7565596|-0.0007026|-0.0011286|35.8043498 unknown
InChI: InChI=1S/C6H2Cl4/c7-3-1-2-4(8)6(10)5(3)9/h1-2H
charge 0 multiplicity 1
12 atoms
Cl 1.611881 2.24198 -0.000048
Cl -1.611699 2.242099 -0.000019
Cl 3.210354 -0.588418 -0.000024
Cl -3.21041 -0.588174 0.000027
C  0.70984 0.685544 0.000011
C  -0.709809 0.685622 -0.000002
C  1.409017 -0.545733 0.000025
C  -1.409047 -0.545624 0.000024
C  0.703853 -1.766736 0.000041
C  -0.70398 -1.76668 0.000013
H  1.254858 -2.711139 0.000035
H  -1.255058 -2.711043 0.000017
