program: Gaussian 09
title: 000215182
version: EM64L-G09RevD.01
frameworkgroup: C1[X(C22H29NO2)]
method: RPBEPBE
basis: SDD
operation: Freq
keyword: #p
keyword: freq=noraman
keyword: PBEPBE/SDD
title: #p freq=noraman PBEPBE/SDD
converged: NO YES NO NO
title: Mulliken charges:
elementType: O O N C C C C C C C C C C C C C C C C C C C C C C H H H H H H H H H H H H H H H H H H H H H H H H H H H H H
charge: -0.467890 -0.270518 -0.178791 -0.009426 -0.443910 -0.445885 -0.392566 -0.369183 -0.031999 -0.612493 -0.212625 -0.777627 0.505335 0.425349 -0.425333 -0.401872 -0.394485 -0.399868 -0.233744 -0.234673 -0.361534 -0.354465 -0.243580 0.315410 -0.538270 0.216157 0.195892 0.204535 0.197555 0.220432 0.238935 0.183695 0.190332 0.219172 0.203429 0.212293 0.206876 0.193599 0.253411 0.228674 0.226258 0.353098 0.232903 0.229510 0.227529 0.281750 0.224535 0.223150 0.245670 0.235878 0.227823 0.218665 0.220697 0.242196
chargesum: 0.00000
title: Mulliken charges with hydrogens summed into heavy atoms:
elementType: O O N C C C C C C C C C C C C C C C C C C C C C C
charge: -0.114792 -0.270518 -0.178791 0.206731 -0.043484 -0.027898 0.030064 0.040320 0.171430 -0.193324 -0.019027 -0.069284 0.505335 0.425349 -0.192430 -0.172362 -0.166956 -0.118119 -0.009210 -0.011524 -0.115864 -0.118587 -0.015757 0.315410 0.143287
polarizability: 3.49845407e+02 -1.83037097e+01 2.03839570e+02 -1.54260464e+01 6.57144857e+00 2.01222301e+02
1716.lowfreq: -16.9847 -6.5512 -0.0008 -0.0004 0.0009 1.9635 13.7586 16.2524 20.8874
frequency: 13.1808 14.4130 20.7911 34.0069 37.7948 49.1426 63.3002 78.5765 97.7675 137.0151 155.6911 166.1636 179.1190 209.2002 217.1271 236.4413 242.1227 249.3525 274.9604 297.9449 315.5610 341.7010 354.9105 369.4437 378.7216 403.1283 408.4216 415.5095 429.5673 444.3587 469.2777 481.2370 502.3816 522.8061 549.3779 586.3212 601.1008 617.0682 628.9931 652.3340 704.9692 715.1918 733.0672 742.2082 753.3510 762.9238 796.9109 803.1665 807.7325 819.0492 822.7077 842.3460 852.9023 861.6521 897.6914 916.3769 935.8006 947.6304 951.1851 970.0304 972.5972 974.6513 981.1890 987.7738 989.9995 990.6250 993.6471 1004.1760 1026.2489 1050.3251 1059.6524 1075.2786 1080.1356 1098.8413 1103.9426 1110.4773 1112.5162 1114.1416 1127.8523 1146.3014 1155.7825 1168.3581 1169.7523 1171.8243 1187.3755 1195.1923 1202.6755 1215.9929 1224.5654 1235.8364 1245.2106 1265.7598 1270.2541 1272.8696 1283.2088 1295.8967 1305.6096 1314.2378 1320.2335 1332.1419 1333.7442 1344.5669 1352.6491 1358.6753 1375.6380 1381.6866 1386.4242 1392.3071 1401.3726 1413.6889 1435.8729 1438.8560 1449.6759 1460.5372 1464.2434 1464.5339 1471.4974 1472.9514 1476.7265 1479.4545 1483.0851 1489.8110 1502.3157 1585.6973 1591.4933 1613.6229 1625.3640 2859.8306 2869.7046 2897.5639 2915.2175 2945.7839 2955.5941 2967.2156 2971.0928 2978.9515 2991.2310 3024.8540 3033.2290 3041.9586 3043.2800 3047.8239 3073.1093 3086.1083 3096.3286 3111.3367 3112.0751 3115.3258 3120.9220 3130.4674 3142.1432 3148.9433 3161.1630 3162.5580 3172.4467 3185.9413
redmass: 4.3701 4.1693 4.5414 4.3680 3.4256 4.1561 4.3089 3.2691 3.8061 4.1928 4.5300 4.0541 3.1787 2.4414 2.9955 1.4655 2.0794 2.2505 3.6014 1.7511 3.2703 2.1737 2.2330 4.7933 2.2882 2.8256 3.6457 3.0925 2.1069 2.9539 3.0440 3.7997 3.1296 2.9742 4.3167 4.0800 2.3472 6.3222 6.7385 2.9923 1.8029 3.5937 2.9353 1.2734 1.7822 3.1574 2.6177 2.1398 2.3245 2.2203 1.2543 1.9973 1.2503 3.2906 1.7041 1.4766 2.2113 1.3942 1.6064 1.9030 1.5286 1.4001 2.0977 2.3605 6.1812 5.8233 1.3589 2.5013 2.2046 2.2612 1.6698 1.9074 2.1403 2.4401 1.8804 1.8097 1.2813 1.7573 1.9078 1.7088 1.3380 1.4048 1.2336 1.0830 1.1281 1.6723 2.0199 2.4566 3.8444 1.3040 1.4917 1.2681 1.2706 1.2144 1.2110 1.3991 1.2975 1.3019 1.3676 1.2879 1.2657 1.4760 1.4854 1.5839 1.6198 6.6616 3.6620 1.2864 1.4393 3.5169 1.1727 2.1460 1.0908 1.0954 1.0740 1.0504 1.1215 1.0726 1.0918 1.0564 2.2209 1.0583 2.5668 7.2539 6.0064 6.1453 6.4971 1.0717 1.0709 1.0810 1.0842 1.0817 1.0330 1.0599 1.0594 1.0621 1.0368 1.1019 1.1013 1.1038 1.0881 1.1007 1.0891 1.0999 1.0976 1.0872 1.0894 1.0868 1.0991 1.0906 1.0957 1.0875 1.1014 1.0945 1.0953 1.0629
irintensity: 0.0448 0.1043 0.2645 1.0550 1.3070 0.4904 0.7656 1.3938 4.0964 1.2593 4.9671 2.1062 1.4849 0.7537 1.2472 0.1635 0.3330 1.5495 3.1301 1.0534 3.7213 0.4997 1.1738 2.3411 10.2560 0.0110 1.2128 0.7761 2.1250 1.6658 1.6366 2.3358 7.4658 11.5378 35.6969 8.1187 1.4634 0.0750 0.6929 0.4907 51.2438 4.6758 19.2761 53.1005 38.1460 21.4096 40.9443 20.4810 4.0398 7.8332 0.1383 31.9344 0.0737 5.6969 0.2753 0.8861 49.7030 1.1784 12.6144 29.3043 10.2003 1.3060 9.0249 8.4486 1.4552 36.8373 0.8641 11.1656 5.1813 1.9094 13.4064 12.6246 27.7587 20.7095 11.7744 17.2716 0.3503 6.1239 15.0082 25.3948 0.1576 1.4747 53.4649 1.5103 1.7615 29.2511 76.8288 0.1618 136.3162 31.3172 18.2288 10.2230 24.4612 4.6255 7.8446 10.3461 17.9662 1.5380 2.3259 1.1475 3.6530 6.4772 1.1112 4.8860 42.6259 1.3158 15.5786 33.4018 61.3590 5.3339 9.2927 7.1515 3.7000 8.2362 3.6745 13.5220 20.2580 56.1433 12.3322 3.3450 18.8172 7.0817 119.8978 12.3425 1.5377 11.5853 36.1995 56.0787 84.6358 39.8434 81.6256 11.3189 73.9859 4.1527 65.9144 33.2680 16.5217 1.1343 62.7538 50.5004 33.3187 54.0856 29.9065 20.7281 26.1060 10.1252 19.5374 8.7237 30.0435 10.8663 44.3458 11.2731 26.3509 10.2209 8.6545 276.4356
temp: 298.150 k
press: 1.00000 atm
elementType: 8 8 7 6 6 6 6 6 6 6 6 6 6 6 6 6 6 6 6 6 6 6 6 6 6 1 1 1 1 1 1 1 1 1 1 1 1 1 1 1 1 1 1 1 1 1 1 1 1 1 1 1 1 1
symmnumber: 1
zpe: 1210172.6 jmol-1
zpe.correction: 0.460930 hartree
zpe.thermalcorrener: 0.484978 hartree
zpe.thermalcorrenthalpy: 0.485923 hartree
zpe.thermalcorrgfe: 0.403690 hartree
zpe.sumelectzpe: -1059.035449 hartree
zpe.sumelectthermal: -1059.011401 hartree
zpe.sumelectthermalent: -1059.010457 hartree
zpe.sumelectthermalfe: -1059.092689 hartree
dipole: 1.3542 1.6387 -1.4074
dipole: 2.5496
quadrupole: -138.9110 -146.7233 -150.3506
quadrupole: -8.9565 -9.0974 0.1384
quadrupole: 6.4173 -1.3950 -5.0223 -8.9565 -9.0974 0.1384
hfenergy: -1059.4963791 hartree
pointgroup: C01 [X(C22H29N1O2)]
dipole: -0.5375566 0.463479 0.7087809 debye
polarizability: 349.8148798|22.2937507|207.2746772|-8.9592528|-4.7690093|197.8177207 unknown
InChI: InChI=1S/C22H29NO2/c1-17(22(24)20-8-10-21(25-2)11-9-20)23-14-12-19(13-15-23)16-18-6-4-3-5-7-18/h3-11,17,19,22,24H,12-16H2,1-2H3
charge 0 multiplicity 1
54 atoms
O  1.6738 0.741371 -1.564774
O  7.65523 -0.89162 0.250798
N  -0.133442 0.765118 0.389241
C  -3.093341 1.019032 0.282833
C  -2.141301 2.237494 0.331101
C  -2.3405 -0.184324 -0.332037
C  -0.816702 1.909116 1.051188
C  -1.009713 -0.443076 0.398275
C  1.272035 0.440299 0.833469
C  -4.403932 1.35989 -0.484066
C  1.983034 -0.152581 -0.454024
C  2.03828 1.655215 1.384517
C  -5.465576 0.272318 -0.397209
C  3.484581 -0.323633 -0.308139
C  -5.737512 -0.585705 -1.493586
C  -6.199781 0.081152 0.803653
C  4.006142 -1.34356 0.531615
C  4.388995 0.517425 -0.991636
C  -6.710841 -1.607038 -1.395472
C  -7.172742 -0.937213 0.908011
C  5.393354 -1.504607 0.701095
C  5.786806 0.366734 -0.837624
C  -7.431725 -1.787522 -0.192994
C  6.289668 -0.645279 0.016479
C  8.619749 -0.041783 -0.448192
H  -3.36795 0.754335 1.327791
H  -2.631254 3.087457 0.846998
H  -1.913353 2.565422 -0.703525
H  -2.129604 0.024562 -1.400518
H  -2.966961 -1.095147 -0.28949
H  -0.155808 2.789844 1.019628
H  -1.029095 1.684775 2.127167
H  -1.217283 -0.758885 1.45159
H  -0.472467 -1.274601 -0.091003
H  1.254586 -0.349909 1.620368
H  -4.149952 1.558482 -1.544189
H  -4.806538 2.306423 -0.069048
H  1.538295 -1.155778 -0.648378
H  3.051304 1.337413 1.68172
H  2.14887 2.442725 0.616899
H  1.547621 2.085047 2.274818
H  0.739571 1.049788 -1.323246
H  -5.185651 -0.448937 -2.432054
H  -6.012764 0.742678 1.659612
H  3.323282 -2.025349 1.054809
H  3.979134 1.281908 -1.657988
H  -6.907683 -2.257432 -2.255466
H  -7.732531 -1.065036 1.841748
H  5.805566 -2.287607 1.345056
H  6.461919 1.029939 -1.387437
H  -8.188432 -2.576318 -0.115563
H  8.497416 1.023243 -0.16869
H  8.528746 -0.146909 -1.547237
H  9.607949 -0.399052 -0.122498
