program: Gaussian 09
title: 000215223
version: EM64L-G09RevD.01
frameworkgroup: C1[X(C20H26I3N3O5)]
method: RPBEPBE
basis: SDD
operation: Freq
keyword: #p
keyword: freq=noraman
keyword: PBEPBE/SDD
title: #p freq=noraman PBEPBE/SDD
converged: YES YES NO NO
title: Mulliken charges:
elementType: I I I O O O O O N N N C C C C C C C C C C C C C C C C C C C C H H H H H H H H H H H H H H H H H H H H H H H H H H
charge: 0.149688 0.170523 0.166974 -0.404632 -0.200740 -0.240611 -0.259355 -0.214962 -0.253925 -0.306948 -0.318983 -0.097862 -0.439389 -0.393425 0.677074 0.550287 -0.736343 0.019035 0.547373 -0.700323 -0.348771 -0.769237 0.150134 -0.688164 0.209415 -0.462537 -0.666086 0.050794 -0.678945 -0.310007 -0.662379 0.287755 0.262915 0.252013 0.227928 0.218112 0.333240 0.262734 0.228332 0.218253 0.223244 0.229158 0.236971 0.249001 0.215714 0.261807 0.218026 0.324209 0.210453 0.225195 0.241456 0.258508 0.225389 0.376638 0.208254 0.241060 0.225961
chargesum: 0.00000
title: Mulliken charges with hydrogens summed into heavy atoms:
elementType: I I I O O O O O N N N C C C C C C C C C C C C C C C C C C C C
charge: 0.149688 0.170523 0.166974 -0.027994 -0.200740 -0.240611 -0.259355 -0.214962 -0.253925 0.026291 0.005226 0.189893 0.075540 0.052615 0.677074 0.550287 -0.736343 0.019035 0.547373 -0.700323 0.142295 -0.769237 0.150134 -0.017509 0.209415 0.023435 0.029461 0.050794 -0.001841 0.173890 0.012896
polarizability: 4.11364544e+02 2.27326915e+00 3.92925282e+02 7.78116902e+00 5.97895929e-01 2.32735066e+02
1716.lowfreq: -4.4369 -1.4758 -0.0008 -0.0005 0.0002 3.5515 9.3270 14.2569 17.3547
frequency: 9.0859 13.9459 17.2712 19.7737 23.3818 25.2515 27.9207 38.2460 38.3631 46.0973 47.5519 55.1644 72.0946 72.7658 82.0471 87.0939 90.7030 94.4572 96.6825 110.5839 113.0735 117.1492 121.5074 149.2763 160.5761 161.1686 177.4775 185.8500 197.0763 201.9744 208.7916 214.3266 227.4914 237.9162 250.6860 261.4176 262.9946 286.5148 292.1650 324.6937 353.8902 362.2873 364.7971 382.2247 401.8638 425.7315 431.0521 460.4808 482.1608 499.0559 520.7959 534.5761 568.3331 581.1838 594.5805 595.4390 618.7163 651.9863 663.6061 671.7954 684.7452 706.8680 721.6422 734.7206 747.7495 756.5672 758.2577 766.9480 788.9532 800.9671 806.8212 836.2772 879.9406 887.4356 902.2904 904.7161 964.7878 986.8471 1004.3189 1012.7782 1022.5187 1042.6904 1051.3562 1066.7566 1068.6693 1076.7808 1080.4674 1087.6599 1101.3699 1105.6618 1108.5137 1134.4881 1142.8593 1151.9593 1206.1199 1221.8543 1230.2726 1235.5195 1240.3548 1260.5644 1271.0893 1272.0725 1285.8951 1297.1048 1310.4747 1314.2889 1318.0301 1327.9803 1336.2076 1347.5566 1353.6780 1366.6678 1379.7450 1381.8796 1386.5758 1392.9199 1394.1136 1397.9690 1441.6558 1447.6012 1448.0678 1464.4747 1467.3859 1468.5605 1469.4202 1476.3519 1477.9515 1480.8340 1481.4373 1482.4091 1483.2929 1485.2440 1493.3398 1505.4655 1510.4738 1602.4160 1604.3770 1608.4611 1649.6717 2980.5593 2981.9517 2982.3757 2982.4925 2984.3460 2991.7581 2997.8871 3012.5857 3015.1218 3033.4924 3035.3743 3056.9721 3065.8996 3072.3461 3078.0541 3082.1508 3086.9856 3087.0347 3088.7441 3093.2091 3096.9224 3106.4983 3113.4474 3496.3414 3536.0949 3553.3678
redmass: 2.5786 5.3719 4.9002 4.7875 4.8847 5.2692 5.5094 3.8755 5.2396 4.1993 5.2303 4.9961 4.5004 5.8676 6.2428 3.9465 13.2257 2.6155 10.6599 6.8483 5.8200 2.6094 7.0504 4.9358 21.2603 3.9011 2.9917 3.7968 1.9595 1.2754 1.8042 1.6767 3.1000 3.2930 2.9609 2.5964 2.5196 2.4510 2.5429 5.6951 5.0659 3.7424 4.1236 3.9326 5.3735 5.5601 5.8095 6.4930 6.5374 5.0574 3.2101 3.5432 2.4981 1.4039 1.5736 3.1116 1.3075 3.9078 8.2856 7.0833 6.6148 4.9506 3.6059 3.8800 3.6209 2.6914 2.5666 2.3009 1.4592 1.3798 2.0783 2.2475 2.5219 2.6342 2.7695 2.4348 1.8725 2.4857 2.8327 6.2414 2.4995 2.8109 2.5414 3.3009 2.8908 2.3995 1.6848 2.0949 2.1440 1.9836 2.5598 2.3625 1.7172 2.5576 3.2903 2.4477 1.4125 2.6369 1.3759 1.1859 1.1974 1.2433 4.1709 2.5360 2.2287 1.4586 5.4143 1.3994 1.8032 1.3992 1.3900 1.3942 1.6178 2.6053 1.2348 1.2215 1.2106 1.2071 1.1077 1.1497 1.0998 1.0509 1.0825 1.0407 1.1020 1.0469 1.0466 1.1880 1.2307 1.2504 1.0686 1.1241 1.8353 6.8533 9.2631 7.6284 7.5936 8.2797 7.9768 1.0578 1.0379 1.0601 1.0590 1.0449 1.0364 1.0365 1.0594 1.0597 1.0980 1.0987 1.0891 1.0963 1.1036 1.1002 1.1002 1.0971 1.0977 1.1032 1.1005 1.1014 1.1000 1.1024 1.0637 1.0778 1.0788
irintensity: 0.1878 0.0849 0.3463 0.5090 0.2556 0.6465 0.6432 0.9007 2.2406 1.4850 1.6326 1.8173 2.9754 1.7596 0.3529 0.5309 1.4389 0.6196 0.5527 1.8681 3.4988 3.3317 0.2436 1.6620 0.2821 1.2290 0.5819 2.1190 0.5928 0.6097 0.4480 5.3689 1.9669 3.7073 1.1719 0.5427 0.2234 6.0132 4.6603 13.7850 11.5544 1.9566 12.2985 5.7218 0.2017 3.9446 41.7341 8.0595 25.0555 3.6380 9.2745 1.3380 2.2431 80.4021 23.8905 56.5511 127.8418 10.4545 2.1107 1.5671 8.0470 8.4702 27.7061 5.6836 7.6946 6.1624 8.5365 14.6483 3.8779 10.9924 15.1410 6.5831 5.7241 10.2684 23.4051 7.2052 22.2675 5.0519 3.1774 22.9451 5.1045 24.9237 159.4477 87.5734 23.6461 5.0194 0.4669 11.6914 7.2202 2.2917 5.6521 23.1438 26.7630 29.9895 104.3420 226.4144 6.3528 165.1920 24.2860 2.1962 32.1300 16.9524 32.2112 34.4693 44.1664 26.4725 4.4376 5.1175 42.0474 25.1757 0.8466 8.3403 80.0722 205.7719 16.9656 19.7121 19.7122 14.8667 30.4276 34.6101 14.7257 7.1749 3.3329 10.9321 51.1643 14.0783 8.7260 57.2174 59.2764 100.4739 13.5163 30.5683 75.5851 173.6273 30.3393 181.4460 185.8852 211.0585 203.1080 25.9227 19.4220 16.0631 39.1152 32.3431 28.6000 31.8572 17.0722 13.1437 7.8728 4.7628 0.9497 8.4811 1.9428 45.1929 42.7374 25.4713 40.3061 13.6336 26.1520 30.9865 21.0968 20.5941 21.9475 23.9043 27.4049
temp: 298.150 k
press: 1.00000 atm
elementType: 53 53 53 8 8 8 8 8 7 7 7 6 6 6 6 6 6 6 6 6 6 6 6 6 6 6 6 6 6 6 6 1 1 1 1 1 1 1 1 1 1 1 1 1 1 1 1 1 1 1 1 1 1 1 1 1 1
symmnumber: 1
zpe: 1142256.6 jmol-1
zpe.correction: 0.435063 hartree
zpe.thermalcorrener: 0.472379 hartree
zpe.thermalcorrenthalpy: 0.473323 hartree
zpe.thermalcorrgfe: 0.354744 hartree
zpe.sumelectzpe: -1350.306749 hartree
zpe.sumelectthermal: -1350.269432 hartree
zpe.sumelectthermalent: -1350.268488 hartree
zpe.sumelectthermalfe: -1350.387067 hartree
dipole: -0.1597 2.0744 0.6139
dipole: 2.1693
quadrupole: -211.8250 -238.1827 -230.6084
quadrupole: -21.6189 -11.6028 15.4809
quadrupole: 15.0470 -11.3106 -3.7364 -21.6189 -11.6028 15.4809
hfenergy: -1350.7418112 hartree
pointgroup: C01 [X(C20H26I3N3O5)]
dipole: -0.1037093 -0.8133579 -0.236802 debye
polarizability: 409.6727038|-2.7997806|393.0925513|-18.1545765|1.2060711|234.2596359 unknown
InChI: InChI=1S/C20H26I3N3O5/c1-5-10(20(30)31)9-25-19(29)13-14(21)12(18(28)24-7-3)15(22)17(16(13)23)26(8-4)11(27)6-2/h10,24-25,30H,5-9H2,1-4H3
charge 0 multiplicity 1
57 atoms
I  1.379591 2.326387 -0.212169
I  -4.477701 0.793973 0.961635
I  -0.245846 -3.607475 0.117221
O  6.767974 -0.848425 -1.570626
O  1.925342 -1.077678 -1.656892
O  6.774491 -2.140219 0.356214
O  -2.533444 4.636878 -0.328101
O  -3.297024 -2.635952 2.06933
N  -1.820295 2.619598 0.55999
N  2.508358 -1.215878 0.594427
N  -3.883213 -2.667129 -0.196232
C  4.870715 -0.625532 -0.07311
C  3.857708 -1.73916 0.330578
C  5.052706 0.42779 1.059235
C  -1.461569 1.241258 0.417033
C  0.228343 -0.539179 0.009502
C  -0.131611 0.828535 0.112121
C  1.626575 -0.956641 -0.432104
C  -2.107898 -1.161972 0.542714
C  -2.434629 0.214335 0.607712
C  -2.001292 3.177907 1.93941
C  -0.770124 -1.518213 0.241952
C  6.203581 -1.292356 -0.369369
C  5.948379 1.619291 0.660299
C  -2.172513 3.441886 -0.533003
C  -2.104673 2.819094 -1.93158
C  -0.852267 4.092734 2.404059
C  -3.148619 -2.224527 0.880466
C  -2.800953 3.697171 -2.987374
C  -4.956028 -3.672648 -0.077864
C  -4.77722 -4.832494 -1.075677
H  4.514044 -0.126916 -0.990516
H  3.77925 -2.476413 -0.488866
H  4.221633 -2.258511 1.233792
H  4.046166 0.803551 1.324403
H  5.467127 -0.078049 1.954004
H  2.186471 -1.11298 1.558293
H  -2.943995 3.753053 1.929175
H  -2.125264 2.323324 2.627959
H  6.005022 2.355712 1.482072
H  5.54798 2.132851 -0.233481
H  6.978741 1.29778 0.424368
H  -2.55091 1.806314 -1.911526
H  -1.038238 2.679126 -2.199811
H  0.100588 3.544967 2.497075
H  -0.717477 4.926247 1.695623
H  -1.10659 4.517972 3.392929
H  -3.679473 -2.27584 -1.119002
H  -2.67805 3.25694 -3.992992
H  -3.879636 3.793268 -2.774089
H  -2.376067 4.714499 -2.98934
H  -4.926669 -4.036007 0.963195
H  -5.937195 -3.180259 -0.231314
H  7.641896 -1.307092 -1.712515
H  -4.789812 -4.476243 -2.123034
H  -3.823074 -5.358428 -0.899853
H  -5.601409 -5.558926 -0.959849
