program: Gaussian 09
title: 000215153
version: EM64L-G09RevD.01
frameworkgroup: C1[X(C12H16N2O5)]
method: RPBEPBE
basis: SDD
operation: Freq
keyword: #p
keyword: freq=noraman
keyword: PBEPBE/SDD
title: #p freq=noraman PBEPBE/SDD
converged: YES YES NO NO
title: Mulliken charges:
elementType: O O O O O N N C C C C C C C C C C C C H H H H H H H H H H H H H H H H
charge: -0.470214 -0.484391 -0.326943 -0.215113 -0.210662 -0.382647 0.024807 -0.128893 -0.170583 0.414675 -0.420793 -0.378442 -0.359883 0.319905 -0.507104 -0.377650 -0.355395 0.373008 -0.662929 0.268426 0.217959 0.238445 0.227823 0.338511 0.272185 0.299367 0.377230 0.241860 0.211493 0.283678 0.283784 0.366698 0.254871 0.219088 0.217829
chargesum: 0.00000
title: Mulliken charges with hydrogens summed into heavy atoms:
elementType: O O O O O N N C C C C C C C C C C C C
charge: -0.092984 -0.117693 -0.326943 -0.215113 -0.210662 -0.044136 0.024807 0.139533 0.047376 0.414675 0.045475 -0.106256 -0.060516 0.319905 -0.053751 -0.093972 -0.071611 0.373008 0.028859
polarizability: 2.58895817e+02 -5.42191372e+00 1.50888736e+02 6.10080327e+00 1.95570452e+01 1.06760608e+02
1716.lowfreq: -9.7739 -7.4444 -2.4877 -0.0008 0.0001 0.0006 18.3401 29.1384 42.2296
frequency: 17.3947 29.0232 42.1854 46.8978 71.8786 73.8139 103.0625 116.4123 138.7730 157.6758 173.2988 208.7656 233.3874 249.9212 276.5836 293.8271 305.1402 318.2253 344.8436 362.7837 410.6504 430.0651 448.5477 486.1135 515.6200 523.9479 583.3993 620.5122 625.3735 666.2993 673.6845 688.1481 694.2074 736.5300 773.1480 778.0380 794.7414 830.3421 853.0575 857.0301 882.6715 897.4611 925.3760 980.5166 993.3276 1005.9873 1007.5533 1018.6766 1024.5850 1069.9265 1076.3296 1080.5445 1090.9975 1106.9889 1111.4900 1171.3614 1173.9774 1200.4458 1214.0048 1221.2446 1237.3825 1250.5827 1267.9566 1276.0562 1302.6449 1315.0670 1323.5722 1354.1473 1363.3878 1391.5784 1398.7822 1405.4752 1417.6333 1448.7793 1454.5964 1472.2998 1474.4828 1481.1048 1483.2184 1488.6467 1588.0708 1595.0736 1607.8880 2950.0385 2971.4541 2987.5578 2996.2238 3008.4225 3041.5077 3051.2400 3091.7408 3108.9339 3136.5112 3145.1444 3170.4255 3181.3935 3187.8711 3500.5936 3594.1380
redmass: 4.7205 5.5532 3.0893 8.2457 4.8547 4.5982 5.3801 5.9445 3.1087 5.1594 5.8135 1.3868 3.8332 5.3574 5.6192 2.4642 3.7419 1.4285 4.1189 5.2059 2.9169 4.1160 3.3973 7.1963 5.8849 3.2100 3.9961 4.2174 6.8171 6.1264 5.1845 1.1311 3.4383 4.0275 1.1235 7.2264 1.3236 2.9709 2.4740 1.5652 1.7701 4.0846 2.6258 2.5328 1.8564 2.0532 1.7718 2.9405 2.7940 1.9773 1.7201 2.4125 3.2729 1.3660 2.0129 1.2066 1.2543 2.5809 1.3666 5.0821 1.2857 1.1990 1.2599 1.3143 1.2760 1.3692 1.2826 1.8730 6.0778 1.1998 1.3945 7.6870 3.3728 1.2300 1.2479 1.0843 1.1029 2.1443 1.8937 1.1539 4.6843 7.7654 6.1036 1.0838 1.0626 1.0591 1.0365 1.0836 1.1007 1.1016 1.1007 1.1004 1.0702 1.0901 1.0887 1.0948 1.0967 1.0779 1.0669
irintensity: 0.1765 1.3333 0.3933 2.3312 1.6704 0.6003 2.2120 4.5259 7.8127 2.0037 3.2679 6.8426 2.9566 1.0245 7.4219 17.7246 1.2441 171.6630 7.0527 5.3931 0.0588 1.4119 11.3507 2.3583 3.2445 12.2074 19.5012 17.2316 1.9021 7.2655 14.8351 99.3807 3.3125 11.7416 108.2850 23.1026 27.5595 10.8408 4.2265 5.0571 45.5006 34.8085 6.3094 2.3334 4.2929 4.6665 3.0289 15.5980 22.4887 56.1703 2.8653 24.7726 20.9829 14.3215 4.9471 25.5619 43.9267 19.2864 44.4138 369.2976 16.9802 2.0205 30.8387 11.4382 9.6801 37.1978 3.8699 9.5364 86.4412 18.9715 1.5212 1.2310 66.5033 108.1864 35.7725 62.4409 29.9831 155.0121 110.0284 90.1898 83.0701 2.2964 59.7503 29.3528 40.6187 23.4816 31.2489 21.5558 14.4061 27.9431 41.7902 21.9260 671.1140 6.5571 0.9198 1.3807 0.3716 64.4076 11.7723
temp: 298.150 k
press: 1.00000 atm
elementType: 8 8 8 8 8 7 7 6 6 6 6 6 6 6 6 6 6 6 6 1 1 1 1 1 1 1 1 1 1 1 1 1 1 1 1
symmnumber: 1
zpe: 719723.9 jmol-1
zpe.correction: 0.274128 hartree
zpe.thermalcorrener: 0.293088 hartree
zpe.thermalcorrenthalpy: 0.294032 hartree
zpe.thermalcorrgfe: 0.224502 hartree
zpe.sumelectzpe: -950.986792 hartree
zpe.sumelectthermal: -950.967832 hartree
zpe.sumelectthermalent: -950.966888 hartree
zpe.sumelectthermalfe: -951.036418 hartree
dipole: 6.9539 5.7868 -1.5783
dipole: 9.1834
quadrupole: -142.4176 -108.4982 -108.5081
quadrupole: 11.2844 1.1000 -2.1397
quadrupole: -22.6097 11.3098 11.2999 11.2844 1.1000 -2.1397
hfenergy: -951.2609204 hartree
pointgroup: C01 [X(C12H16N2O5)]
dipole: -2.7982375 2.0369111 1.0367886 debye
polarizability: 258.4894721|6.8533211|157.0237074|8.5011907|-9.2542583|101.0319829 unknown
InChI: InChI=1S/C12H16N2O5/c1-2-11(16)13-10(7-15)12(17)8-3-5-9(6-4-8)14(18)19/h3-6,10,12-13,15,17H,2,7H2,1H3
charge 0 multiplicity 1
35 atoms
O  -1.200739 -1.857645 -0.567821
O  -1.264055 2.513714 0.657263
O  -3.818846 -1.61659 0.022151
O  5.403807 1.242618 -0.439643
O  5.562953 -0.894902 0.339605
N  -3.05753 0.527253 0.478064
N  4.879199 0.112956 -0.091802
C  -1.670213 0.137769 0.816312
C  -0.897725 -0.439142 -0.445267
C  0.616349 -0.297378 -0.360076
C  -1.037492 1.339139 1.528517
C  1.246139 0.914368 -0.749795
C  1.409658 -1.380052 0.096425
C  -4.049277 -0.361686 0.142393
C  -5.447678 0.216798 -0.059489
C  2.64369 1.057558 -0.667359
C  2.809567 -1.253659 0.189855
C  3.407474 -0.03131 -0.189001
C  -6.140602 -0.367628 -1.31078
H  -1.706066 -0.705867 1.535477
H  -1.258904 0.129107 -1.329881
H  0.040834 1.162313 1.691589
H  -1.537715 1.492116 2.506804
H  -3.217007 1.537447 0.405455
H  0.632829 1.745192 -1.115104
H  0.907315 -2.319099 0.342358
H  -2.19011 -1.986952 -0.389175
H  -6.040403 -0.043568 0.839678
H  -5.409104 1.321693 -0.107473
H  3.150913 1.978223 -0.967321
H  3.441398 -2.074993 0.53818
H  -0.868931 3.320755 1.068946
H  -6.131414 -1.469211 -1.265224
H  -7.187775 -0.023098 -1.370281
H  -5.622638 -0.060035 -2.236579
