program: Gaussian 09
title: 000215218
version: EM64L-G09RevD.01
frameworkgroup: C1[X(C16H22FNO10)]
method: RPBEPBE
basis: SDD
operation: Freq
keyword: #p
keyword: freq=noraman
keyword: PBEPBE/SDD
title: #p freq=noraman PBEPBE/SDD
converged: YES YES NO NO
title: Mulliken charges:
elementType: F O O O O O O O O O O N C C C C C C C C C C C C C C C C H H H H H H H H H H H H H H H H H H H H H H
charge: -0.241378 -0.220015 -0.251921 -0.281965 -0.241111 -0.254353 -0.246536 -0.250119 -0.250870 -0.226492 -0.268718 -0.392337 -0.138351 -0.085613 -0.097573 -0.052465 -0.007112 -0.381532 0.194346 0.310179 0.335051 0.304598 -0.316867 -0.758124 -0.771370 0.325958 -0.756516 -0.761558 0.269882 0.314858 0.324952 0.226161 0.221863 0.248524 0.260567 0.357409 0.242068 0.240350 0.256765 0.257533 0.247800 0.247125 0.243077 0.283895 0.260430 0.245674 0.258833 0.249599 0.241096 0.284305
chargesum: 0.00000
title: Mulliken charges with hydrogens summed into heavy atoms:
elementType: F O O O O O O O O O O N C C C C C C C C C C C C C C C C
charge: -0.241378 -0.220015 -0.251921 -0.281965 -0.241111 -0.254353 -0.246536 -0.250119 -0.250870 -0.226492 -0.268718 -0.034929 0.131532 0.229244 0.227379 0.173696 0.214751 0.127559 0.194346 0.310179 0.335051 0.304598 0.165551 0.003975 0.002727 0.325958 0.008420 0.013442
polarizability: 2.44737511e+02 1.36167991e+01 2.07496712e+02 -2.44832020e+00 7.06363314e-01 1.83790833e+02
1716.lowfreq: -6.8101 -4.4701 -0.0007 -0.0007 -0.0006 3.9807 18.1941 23.1534 30.2961
frequency: 18.1317 23.0024 30.0587 30.5746 41.2574 43.3077 46.0693 57.3287 59.0112 68.2150 70.7341 77.4511 79.6264 91.5153 94.9671 100.1112 108.6784 109.3654 110.1689 128.9113 135.8944 163.2444 186.8321 188.9927 199.5959 213.6838 236.4539 245.7832 261.4188 286.2387 302.5786 319.3838 348.5474 376.5168 394.9104 426.8232 437.6222 463.3505 468.6997 496.4799 512.0525 524.2909 538.4088 560.0338 561.4399 563.5263 568.4319 577.9244 603.9985 607.6971 631.6907 640.5474 655.7689 658.4218 688.4331 790.4094 816.0731 829.3130 846.2726 873.5922 903.8006 923.5061 945.6904 957.2465 958.2346 978.7334 988.4842 998.4105 998.6618 999.1643 1003.0652 1018.2399 1042.9432 1043.8184 1045.9302 1048.1522 1052.7900 1071.0979 1084.1561 1088.8319 1123.7837 1135.5974 1145.5778 1171.1119 1174.6200 1180.2653 1191.0078 1199.1689 1208.8355 1237.0741 1247.6107 1259.7418 1282.1450 1294.7081 1315.5077 1332.8678 1333.6393 1338.8516 1346.0482 1356.2159 1362.3412 1369.6924 1384.7391 1385.5224 1386.1463 1386.8482 1435.9083 1450.5754 1451.7684 1451.8953 1452.0859 1452.5023 1453.9695 1455.9161 1456.8668 1458.6108 1508.1017 1630.3490 1647.8610 1654.0877 1662.8677 1677.0986 2937.0755 2953.3175 3000.1655 3003.8017 3004.7904 3008.6907 3009.3596 3034.1076 3034.5075 3049.9936 3067.0159 3096.6905 3099.1488 3100.7854 3101.6200 3106.0782 3108.8927 3141.6412 3142.2879 3146.1066 3146.3680 3497.6092
redmass: 6.6705 8.1972 5.0011 8.2143 7.1652 4.9223 5.0329 2.7365 1.4954 3.6718 3.1529 3.5463 1.3459 3.6543 4.7389 4.3258 1.7094 1.0713 1.4478 6.0603 7.6376 9.1814 6.2176 8.6064 6.5536 6.6987 5.2933 5.4987 6.3686 5.6189 2.4662 6.8242 4.1663 3.8664 3.8739 4.9484 3.9654 6.2646 4.9272 4.6531 3.7404 3.7088 3.7311 3.3397 3.2933 3.3547 3.5385 3.8958 4.4238 4.3170 4.7387 3.8242 4.4024 1.3488 4.2279 4.3454 6.3321 5.6123 5.4712 3.9669 7.0498 4.6688 6.3478 5.4840 5.2419 3.1840 3.1404 2.0937 2.1767 2.0015 2.3360 3.6348 1.6739 1.7049 1.7162 1.6475 3.7309 3.7419 3.3039 4.0359 3.4768 2.4985 3.0822 1.0779 2.9990 2.9954 3.0362 1.7534 2.2652 1.6117 1.3727 1.1604 1.3190 1.2407 1.3376 1.3045 1.3422 1.3879 1.3038 1.4070 1.4404 1.3444 1.2373 1.2501 1.2482 1.2475 1.0772 1.0484 1.0573 1.0505 1.0571 1.0610 1.0570 1.0726 1.0533 1.0622 1.9760 8.7081 9.4067 9.3456 10.2152 9.9876 1.0828 1.0832 1.0838 1.0388 1.0386 1.0374 1.0375 1.0559 1.0575 1.0847 1.0848 1.0963 1.0955 1.0932 1.0934 1.1070 1.1096 1.1028 1.1028 1.1015 1.1020 1.0775
irintensity: 0.3066 1.5787 0.2672 0.2064 0.9327 0.2947 0.2300 1.9589 4.1918 1.6405 5.1184 7.5063 0.9127 0.8173 1.3056 6.7292 10.8615 0.0898 11.3998 0.7834 1.2517 0.7023 6.9575 0.2337 7.6640 0.9273 3.2551 1.4373 0.5115 13.4081 10.0125 27.7709 23.6211 9.8734 1.2587 1.8809 11.2125 13.0425 6.2218 2.5569 18.6309 2.8342 12.9548 5.5141 23.5884 10.6235 10.9363 19.5521 15.5043 14.8144 5.6208 4.5096 1.9906 115.5630 5.9168 19.7471 21.1307 40.7473 60.6792 26.0715 27.7957 71.3191 89.3208 57.4862 8.8819 296.2267 231.6159 92.6843 46.4067 70.6695 108.2478 13.5025 13.0898 9.8866 7.1715 17.0608 50.3558 22.0045 55.2667 28.6831 5.2703 23.9030 4.2953 4.7855 48.5059 426.0044 423.7838 97.4532 208.8816 13.5594 28.4124 2.2784 15.6448 24.3848 15.3160 7.6241 5.0081 3.5062 3.4033 6.1272 2.0997 1.1000 76.0624 47.3059 76.5661 62.9073 20.0082 15.8853 16.2885 35.2978 36.6510 21.9554 3.1156 23.1548 13.1147 10.5693 275.4771 182.9014 146.9530 116.0736 231.9616 186.5617 23.9662 20.7374 11.9124 1.7291 0.9968 0.7837 0.4394 15.3413 22.3751 9.5304 5.9916 4.7634 4.5540 7.6729 5.2722 3.9990 8.9089 5.9793 7.6813 8.4071 9.0517 52.0912
temp: 298.150 k
press: 1.00000 atm
elementType: 9 8 8 8 8 8 8 8 8 8 8 7 6 6 6 6 6 6 6 6 6 6 6 6 6 6 6 6 1 1 1 1 1 1 1 1 1 1 1 1 1 1 1 1 1 1 1 1 1 1
symmnumber: 1
zpe: 992786.9 jmol-1
zpe.correction: 0.378133 hartree
zpe.thermalcorrener: 0.409458 hartree
zpe.thermalcorrenthalpy: 0.410403 hartree
zpe.thermalcorrgfe: 0.310539 hartree
zpe.sumelectzpe: -1527.603273 hartree
zpe.sumelectthermal: -1527.571947 hartree
zpe.sumelectthermalent: -1527.571003 hartree
zpe.sumelectthermalfe: -1527.670866 hartree
dipole: 0.0200 1.0477 0.1586
dipole: 1.0598
quadrupole: -157.1877 -150.2700 -173.7989
quadrupole: 6.4450 -5.6439 -0.8578
quadrupole: 3.2311 10.1489 -13.3801 6.4450 -5.6439 -0.8578
hfenergy: -1527.9814053 hartree
pointgroup: C01 [X(C16H22F1N1O10)]
dipole: 0.1028518 -0.3937418 0.0908181 debye
polarizability: 235.3136573|21.2134379|216.7190565|-0.5408971|-3.2227468|183.9923428 unknown
InChI: InChI=1S/C16H22FNO10/c1-7(19)24-6-11-14(25-8(2)20)15(26-9(3)21)13(18-12(23)5-17)16(28-11)27-10(4)22/h11,13-16,18H,5-6H2,1-4H3
charge 0 multiplicity 1
50 atoms
F  5.115531 -0.56184 -0.963548
O  -0.572702 1.946267 -0.347756
O  0.626051 -1.991287 0.439802
O  -1.906549 -1.493664 -0.917561
O  1.581076 2.77538 -0.043985
O  -3.383356 1.193923 0.541102
O  3.435426 0.680565 2.027128
O  2.074143 -2.818063 -1.199607
O  -2.805947 -2.205796 1.125041
O  1.513699 3.901236 -2.100748
O  -5.105715 -0.190671 -0.227766
N  2.689952 0.063436 -0.116133
C  0.371973 -0.786388 -0.380772
C  1.279482 0.371092 0.111207
C  -1.117114 -0.442105 -0.234206
C  -1.423281 0.896952 -0.947129
C  0.841996 1.671048 -0.611956
C  -2.878552 1.347468 -0.844903
C  3.648564 0.253191 0.855672
C  1.500862 -2.957027 -0.096728
C  -2.746643 -2.305747 -0.11759
C  1.822432 3.892218 -0.894479
C  5.074692 -0.104941 0.428876
C  1.625463 -4.122959 0.852813
C  -3.562482 -3.22476 -0.989691
C  -4.516288 0.375237 0.721626
C  2.478671 4.992137 -0.100347
C  -4.8555 0.260389 2.185345
H  0.598239 -1.028222 -1.439445
H  1.139533 0.528431 1.196493
H  -1.404357 -0.389975 0.830728
H  -1.176724 0.801008 -2.02979
H  1.010393 1.618852 -1.711215
H  -2.93958 2.42109 -1.086753
H  -3.51719 0.759031 -1.526127
H  2.988772 -0.365022 -0.999393
H  5.721556 0.785378 0.509081
H  5.463724 -0.921298 1.061182
H  2.140723 -3.797983 1.774334
H  0.627054 -4.48401 1.150941
H  2.198928 -4.931308 0.377617
H  -3.031842 -3.473374 -1.921067
H  -3.822933 -4.137453 -0.432623
H  -4.49975 -2.697747 -1.249383
H  1.73292 5.445467 0.577297
H  2.869401 5.763954 -0.778685
H  3.284654 4.583878 0.531086
H  -4.51939 1.146643 2.743793
H  -5.938397 0.106712 2.308862
H  -4.330019 -0.627143 2.584559
