program: Gaussian 09
title: 000215169
version: EM64L-G09RevD.01
frameworkgroup: C1[X(C22H31NO2)]
method: RPBEPBE
basis: SDD
operation: Freq
keyword: #p
keyword: freq=noraman
keyword: PBEPBE/SDD
title: #p freq=noraman PBEPBE/SDD
converged: YES YES NO NO
title: Mulliken charges:
elementType: O O N C C C C C C C C C C C C C C C C C C C C C C H H H H H H H H H H H H H H H H H H H H H H H H H H H H H H H
charge: -0.313454 -0.453879 -0.320740 0.003521 -0.618531 -0.617046 -0.095417 -0.313923 -0.419965 0.494873 0.502349 -0.344094 -0.367665 -0.344655 -0.426961 -0.438955 -0.424436 -0.383361 -0.687431 -0.223684 -0.226190 -0.227863 -0.234604 -0.242273 -0.249416 0.266529 0.219844 0.227336 0.224741 0.221509 0.201315 0.228835 0.199093 0.224025 0.238893 0.183955 0.211553 0.235834 0.179720 0.206093 0.194132 0.194789 0.249554 0.235155 0.236859 0.241701 0.365270 0.205747 0.210129 0.218256 0.227968 0.225140 0.224230 0.220090 0.227548 0.227958
chargesum: 0.00000
title: Mulliken charges with hydrogens summed into heavy atoms:
elementType: O O N C C C C C C C C C C C C C C C C C C C C C C
charge: -0.313454 -0.088610 -0.084906 0.270051 -0.171351 -0.170796 0.105898 0.114005 0.042953 0.494873 0.502349 0.051414 0.018147 0.044266 -0.177407 -0.203800 -0.187578 -0.141661 -0.053299 0.004284 -0.001050 -0.003633 -0.014513 -0.014724 -0.021458
polarizability: 2.82605621e+02 1.07704883e+01 2.36763015e+02 -2.18612457e+01 8.74898819e+00 2.10107244e+02
1716.lowfreq: -8.1572 -7.0935 -0.4120 0.0005 0.0007 0.0008 10.1703 20.9431 24.5988
frequency: -5.6064 20.7107 24.5295 26.9588 36.3603 40.4047 45.7806 48.5002 54.9051 76.8434 96.3287 105.1878 119.1576 121.8859 154.3276 180.3840 187.4558 192.2388 229.4131 234.9385 244.5473 269.5513 321.3531 336.4302 344.5187 357.7493 374.0995 382.3535 403.6551 405.2720 429.5050 454.8727 471.7427 494.8009 499.1555 517.8245 583.3873 596.0698 617.1914 617.8319 641.4253 706.3000 707.4692 731.9939 739.4945 743.0994 760.1038 777.4271 798.0107 808.6757 817.7039 824.7170 857.1373 858.7021 874.2212 893.3951 908.1312 920.1721 925.0689 933.1398 962.6466 977.8616 978.4273 981.5448 987.5103 989.4485 990.0574 994.2705 995.1761 1020.5659 1023.2185 1027.0860 1028.7844 1036.0639 1066.1896 1073.1557 1076.3276 1082.6489 1091.4145 1101.0821 1124.7165 1130.4749 1145.7847 1156.8049 1171.5387 1171.8688 1186.6925 1188.8099 1200.3215 1213.3219 1217.2209 1222.9053 1225.1020 1236.4152 1261.9743 1271.1225 1277.0108 1284.6702 1288.5397 1301.1732 1320.8564 1327.0644 1329.1340 1339.4130 1341.9976 1349.6512 1355.8923 1363.7676 1373.1587 1381.6398 1382.7358 1386.7502 1391.3878 1435.4604 1439.3709 1440.4041 1448.3830 1457.8132 1466.3791 1466.7483 1473.1695 1476.1969 1483.4782 1483.6789 1484.3428 1491.8197 1501.6414 1591.2118 1591.4864 1612.6216 1613.5026 2862.9006 2908.5225 2957.1413 2970.0788 2971.3683 2982.3062 2990.1491 2991.0835 2992.7921 2995.5241 3004.6702 3008.3617 3030.7950 3036.7736 3050.8197 3054.7053 3067.3179 3069.4850 3073.0107 3108.1499 3110.7934 3115.6681 3119.1587 3127.9399 3131.8307 3139.0233 3143.1425 3159.8324 3162.0671 3395.1865 3500.1311
redmass: 4.8040 4.3250 4.2589 4.3125 3.6812 3.0889 3.0062 2.6666 3.6463 3.3844 4.9066 4.4153 2.0858 2.4785 4.3906 3.7149 2.9620 4.1013 1.1306 4.7195 3.0712 3.8598 3.1611 2.9814 2.0983 2.7972 3.9263 2.5823 2.8544 2.8451 2.2627 1.6152 2.2301 3.7504 3.2611 3.0509 4.7515 4.0016 6.2608 6.2918 2.8749 2.0202 1.8136 1.2520 1.1370 1.6390 1.8929 3.0067 1.1539 2.9837 3.7633 2.8266 1.2579 1.2483 1.9576 1.8526 2.0160 1.5126 1.4985 1.1972 2.5843 1.4327 1.4355 2.9190 2.8423 6.0080 4.0344 1.3186 1.3288 2.6498 2.7228 2.2031 2.2190 2.4803 2.5919 1.8590 2.4451 1.9230 1.6349 2.0334 2.6845 2.2350 1.4095 1.3673 1.0543 1.0518 1.1213 1.1339 1.4983 2.2341 2.3287 1.4048 1.3755 1.3362 1.2086 1.2971 1.1422 1.0969 1.3102 1.4150 1.3021 1.2942 1.2704 1.3004 1.4030 1.3454 1.4588 1.2807 1.3098 7.3603 5.5955 1.3182 1.3529 1.0977 2.1146 2.1525 1.2053 1.1065 1.0777 1.1177 1.0602 1.0439 1.5225 1.6856 1.8083 1.0907 1.0766 6.0238 6.0208 6.1160 6.0504 1.0706 1.0702 1.0633 1.0585 1.0386 1.0791 1.0669 1.0597 1.0840 1.0644 1.0760 1.0979 1.0901 1.1015 1.1022 1.1015 1.1007 1.1062 1.0993 1.0873 1.0875 1.0870 1.0865 1.0916 1.0909 1.0952 1.0957 1.1012 1.1013 1.0735 1.0650
irintensity: 0.0317 0.0311 0.0229 0.0820 0.0808 0.1958 0.2200 0.4460 0.8300 0.1329 0.4218 0.5424 0.5007 1.7051 1.6230 0.6803 5.3668 1.9720 0.0414 2.2036 4.0579 1.4782 1.2738 7.3552 1.0992 5.0677 8.3244 0.3067 0.1042 0.0142 15.6257 46.7800 60.2645 2.0973 21.7569 23.1433 9.5891 7.5160 0.1747 0.4406 10.7131 26.4623 69.5037 27.0711 36.5905 52.0970 65.7392 9.9895 1.1904 3.2650 0.7762 6.2301 0.2678 0.8115 1.4724 3.5074 9.1258 7.9681 4.6571 0.8757 12.7792 4.4332 6.3730 48.9544 24.0466 0.8820 15.0181 1.2394 0.3814 21.9736 18.2471 6.0655 22.9334 0.2804 22.2229 37.0439 2.4539 34.9747 13.3979 35.5932 5.9723 16.9127 16.5373 10.0283 0.1737 0.0733 0.2946 0.4755 5.4448 0.3743 1.8715 2.5724 26.3650 3.0047 7.6977 1.4250 0.9130 0.4233 9.0607 7.2549 6.4584 1.8099 0.6485 8.9053 5.4024 3.3091 2.7637 11.4277 25.0877 0.6656 0.1320 7.0358 5.8033 5.7560 6.6027 8.5555 25.4677 11.9210 2.2673 6.9908 1.1784 10.8018 24.6745 2.8511 23.0358 5.9189 5.3630 0.8411 1.3222 11.7122 5.8527 86.4053 75.6070 9.1815 56.8676 26.4686 4.5679 12.6503 17.5533 35.5950 32.1823 59.3600 1.5909 37.4451 61.9320 13.7670 20.3450 109.0942 34.9039 47.9189 4.0635 8.5368 7.1640 3.9038 7.5245 10.5190 41.1338 36.8479 28.8924 22.7157 2.7916 21.9968
temp: 298.150 k
press: 1.00000 atm
elementType: 8 8 7 6 6 6 6 6 6 6 6 6 6 6 6 6 6 6 6 6 6 6 6 6 6 1 1 1 1 1 1 1 1 1 1 1 1 1 1 1 1 1 1 1 1 1 1 1 1 1 1 1 1 1 1 1
symmnumber: 1
zpe: 1265268.9 jmol-1
zpe.correction: 0.481915 hartree
zpe.thermalcorrener: 0.507270 hartree
zpe.thermalcorrenthalpy: 0.508215 hartree
zpe.thermalcorrgfe: 0.423330 hartree
zpe.sumelectzpe: -1060.209127 hartree
zpe.sumelectthermal: -1060.183773 hartree
zpe.sumelectthermalent: -1060.182828 hartree
zpe.sumelectthermalfe: -1060.267713 hartree
dipole: -2.7281 0.9051 0.9106
dipole: 3.0152
quadrupole: -158.3101 -142.5279 -151.2592
quadrupole: -4.3752 3.0332 0.5963
quadrupole: -7.6110 8.1712 -0.5602 -4.3752 3.0332 0.5963
hfenergy: -1060.6910429 hartree
pointgroup: C01 [X(C22H31N1O2)]
dipole: 0.1215803 0.1615109 -1.1689082 debye
polarizability: 244.7589178|2.7145677|203.479156|17.6598663|-13.5048689|281.2378063 unknown
InChI: InChI=1S/C22H31NO2/c1-2-3-14-23-17-21(24)18-25-22(15-19-10-6-4-7-11-19)16-20-12-8-5-9-13-20/h4-13,21-24H,2-3,14-18H2,1H3
charge 0 multiplicity 1
56 atoms
O  -0.444766 -1.410517 2.23961
O  2.060021 -1.799435 3.550112
N  2.352905 -1.539339 -0.219286
C  -0.908244 -0.589511 1.096273
C  -1.335792 0.770828 1.692904
C  -2.083722 -1.300798 0.365305
C  1.891624 -2.233921 2.155871
C  0.409829 -2.560588 1.882741
C  2.499001 -1.170652 1.211357
C  -0.169034 1.593642 2.213179
C  -2.381217 -0.683349 -0.993629
C  2.883364 -0.517209 -1.156877
C  2.720435 -0.958103 -2.623524
C  3.272294 0.078234 -3.628777
C  0.248417 1.499028 3.566333
C  -3.586643 0.020838 -1.241626
C  0.555233 2.448363 1.341404
C  -1.430024 -0.78901 -2.044252
C  3.066885 -0.348661 -5.098023
C  1.364165 2.230525 4.034512
C  -3.83986 0.603564 -2.505434
C  1.67029 3.18332 1.805159
C  -1.678451 -0.207836 -3.306674
C  2.080893 3.074345 3.154289
C  -2.885666 0.492229 -3.542552
H  -0.070955 -0.456161 0.381712
H  -2.057147 0.559493 2.505249
H  -1.875388 1.326082 0.902749
H  -1.806677 -2.365252 0.237668
H  -2.976461 -1.275406 1.017504
H  2.472333 -3.17572 2.084972
H  0.094411 -3.383967 2.547783
H  0.27332 -2.853675 0.824131
H  3.55984 -1.018768 1.52086
H  1.983575 -0.205272 1.376197
H  3.959582 -0.279604 -0.96072
H  2.319107 0.421676 -0.98595
H  2.789602 -2.455504 -0.408923
H  3.239204 -1.928293 -2.78013
H  1.646478 -1.14005 -2.825602
H  4.352687 0.238112 -3.436312
H  2.776546 1.054834 -3.454092
H  -0.31142 0.851543 4.252383
H  -4.33313 0.10802 -0.442212
H  0.236456 2.543734 0.295237
H  -0.493343 -1.333488 -1.865406
H  1.378686 -1.090256 3.703681
H  1.991797 -0.481101 -5.325322
H  3.573467 -1.30979 -5.307311
H  3.469691 0.405362 -5.79872
H  1.673594 2.142309 5.082191
H  -4.779076 1.140758 -2.680375
H  2.213919 3.842868 1.118796
H  -0.935039 -0.302092 -4.107405
H  2.94539 3.642247 3.51602
H  -3.081087 0.941778 -4.522648
