program: Gaussian 09
title: 000215163
version: EM64L-G09RevD.01
frameworkgroup: C1[X(C22H31NO2)]
method: RPBEPBE
basis: SDD
operation: Freq
keyword: #p
keyword: freq=noraman
keyword: PBEPBE/SDD
title: #p freq=noraman PBEPBE/SDD
converged: YES YES NO NO
title: Mulliken charges:
elementType: O O N C C C C C C C C C C C C C C C C C C C C C C H H H H H H H H H H H H H H H H H H H H H H H H H H H H H H H
charge: -0.329129 -0.459916 -0.124671 0.060951 -0.086827 -0.402650 -0.267834 -0.635841 -0.580266 -0.322289 -0.316461 0.503993 0.484043 -0.674109 -0.675484 -0.372430 -0.395179 -0.448106 -0.449255 -0.231010 -0.237020 -0.225746 -0.224544 -0.245031 -0.249898 0.199127 0.187710 0.212667 0.228601 0.219193 0.193746 0.220430 0.222583 0.252885 0.214420 0.190786 0.209398 0.191124 0.203734 0.360690 0.222696 0.208702 0.209365 0.221502 0.209994 0.210217 0.254843 0.253701 0.227124 0.228431 0.223238 0.227232 0.223826 0.223396 0.226491 0.226860
chargesum: 0.00000
title: Mulliken charges with hydrogens summed into heavy atoms:
elementType: O O N C C C C C C C C C C C C C C C C C C C C C C
charge: -0.329129 -0.099226 -0.124671 0.260078 0.100883 0.038619 0.145105 -0.192828 -0.112962 0.077895 0.078396 0.503993 0.484043 -0.033346 -0.033772 -0.117587 -0.141478 -0.220982 -0.220824 -0.007772 -0.009788 -0.001920 -0.001148 -0.018540 -0.023038
polarizability: 2.70163999e+02 -5.22232889e+00 2.81940552e+02 -1.64158146e+01 -8.09839096e+00 1.89982302e+02
1716.lowfreq: -11.7086 -4.9166 -1.0912 -0.0006 0.0001 0.0004 6.6744 10.1038 15.4453
frequency: -8.6963 8.5700 14.9060 22.5183 34.7552 41.1214 42.0926 45.7121 68.9789 82.6255 88.4141 100.5852 119.1442 146.2541 156.4148 186.8292 196.4400 220.9761 231.1340 248.9527 268.3278 269.6145 293.1614 313.2280 340.7647 358.0064 369.6910 403.3859 403.8172 426.5714 445.0290 450.3713 455.1907 480.8741 494.6613 504.6235 517.3454 527.3351 568.7477 617.7374 618.5896 658.0138 704.1372 708.0000 740.6796 749.8534 753.0734 781.3571 796.0310 797.5633 806.3568 829.9986 845.7876 852.4510 857.9773 885.6233 892.0565 916.6527 922.1475 930.0844 961.8528 973.8331 978.1858 981.3063 988.0252 990.2784 990.9696 993.3803 997.7110 1016.9169 1026.4839 1029.1687 1035.9445 1060.5037 1067.4079 1076.3479 1078.5285 1082.0389 1084.9320 1089.2796 1098.1294 1126.4068 1152.3254 1170.3325 1170.7966 1187.3630 1187.6599 1191.4050 1200.2941 1205.6335 1210.0340 1212.5216 1219.2649 1239.8538 1250.4889 1263.6304 1283.5883 1291.2589 1298.1776 1308.5823 1323.6040 1327.2906 1339.4310 1351.6768 1363.7558 1366.9478 1367.7668 1379.8330 1383.0157 1384.2088 1387.7540 1388.9865 1396.9888 1435.3788 1440.0428 1447.2680 1459.7906 1462.2150 1463.2465 1465.0880 1470.5458 1479.0425 1482.3203 1482.7524 1483.9458 1487.0324 1492.0349 1589.8133 1591.5773 1613.9359 1614.3540 2856.3737 2865.1738 2911.9186 2938.7501 2945.7084 2949.7859 2980.4602 2983.0278 2983.7001 2985.8497 3025.2720 3028.6719 3030.0994 3036.2318 3040.5894 3052.5374 3076.6604 3077.9730 3088.8878 3089.2903 3109.9355 3111.8160 3123.6336 3123.8283 3136.7358 3136.9927 3150.4554 3152.6092 3162.8612 3164.4074 3524.4561
redmass: 3.7103 4.2152 4.1566 3.6040 4.8763 4.2021 3.8650 3.7812 3.0048 2.8236 2.0026 4.1298 3.7844 2.5520 4.1932 2.6239 2.4699 1.3663 3.2593 3.8329 2.2643 2.4059 2.0476 3.1855 2.1936 2.4257 3.5173 2.8018 2.7660 2.4882 2.6322 1.9399 2.5616 1.7978 2.4910 2.8103 3.0084 3.4423 4.1994 6.1595 6.2164 3.9590 1.6705 2.0522 1.7193 2.6015 2.3373 2.9126 1.2060 1.1878 3.4531 2.6775 2.4114 1.2513 1.2536 1.7747 2.0110 1.5207 1.6044 1.8023 2.7366 1.4092 1.7237 1.8228 2.4982 4.4627 4.7232 1.4721 1.3702 4.6009 2.2009 2.1672 2.3955 2.2193 2.1287 1.8582 1.7083 1.6855 2.1233 2.1404 2.1084 1.9139 1.3696 1.0562 1.0587 1.1185 1.1173 1.2988 1.5079 2.1386 2.2106 1.4757 1.7991 1.3202 1.2649 1.2988 1.1637 1.2230 1.2228 1.5090 1.2428 1.2664 1.3881 1.3683 1.3321 1.7648 1.3833 2.0139 2.9110 3.3227 1.2379 1.2415 1.7124 1.5169 2.1015 1.3820 1.1232 1.0592 1.0634 1.0878 1.0585 1.0611 1.0681 2.2912 2.3177 1.0630 1.0728 5.9815 6.0396 6.1865 6.1466 1.0722 1.0715 1.0700 1.0708 1.0824 1.0718 1.0630 1.0356 1.0356 1.0617 1.0876 1.1002 1.1001 1.0874 1.0981 1.0909 1.0985 1.0980 1.1004 1.1004 1.0875 1.0868 1.0862 1.0864 1.0923 1.0924 1.0947 1.0954 1.1008 1.1002 1.0651
irintensity: 0.0272 0.0148 0.1012 0.3716 0.0372 0.1346 0.1430 0.5521 2.4680 0.1042 0.1453 0.4284 0.0134 0.5319 5.4835 2.6515 2.4628 1.2678 2.3130 4.7893 0.4657 5.4599 2.8225 4.1025 0.9859 2.8133 2.5366 0.2487 2.6657 2.1351 0.6348 60.7663 13.6093 75.4003 65.2789 9.1957 18.4789 18.9518 3.6184 1.2341 0.2211 9.9523 56.2640 30.4121 43.4486 14.6905 36.2469 12.2797 5.5906 11.7021 3.0279 4.2988 5.1744 0.0999 0.1064 5.0569 10.1404 0.9846 3.8250 11.3374 9.8441 0.2078 16.0732 14.1338 14.3972 0.1174 0.6595 0.1438 1.3112 136.3694 5.5050 15.8522 78.7102 10.2569 27.6787 9.9222 3.7267 12.4881 1.8744 41.7697 2.4712 8.8113 26.7626 0.1248 0.2387 0.5004 0.3498 18.0000 2.0917 28.8507 1.3360 0.6524 4.5411 29.7450 8.9466 21.3266 5.3153 20.7185 18.9182 0.5277 9.8583 2.0053 2.7915 9.7935 1.5604 4.0777 13.1068 1.0049 1.1578 1.9578 19.1436 18.3755 16.3125 1.4741 8.7744 17.9478 3.2598 8.7686 2.1489 15.8779 0.7766 1.4184 15.9353 35.1384 17.7838 11.1260 14.8767 1.0672 0.5710 18.4378 3.4746 30.5866 184.2324 89.5651 21.9790 4.9152 90.9036 39.8559 33.8433 24.1481 27.8608 16.8640 24.4376 28.2282 14.3550 23.6515 34.4788 34.8243 81.0519 37.9750 59.3757 11.4354 8.8531 0.3228 0.5803 25.4214 29.3916 25.8552 35.4184 23.4344 15.2103 16.4530
temp: 298.150 k
press: 1.00000 atm
elementType: 8 8 7 6 6 6 6 6 6 6 6 6 6 6 6 6 6 6 6 6 6 6 6 6 6 1 1 1 1 1 1 1 1 1 1 1 1 1 1 1 1 1 1 1 1 1 1 1 1 1 1 1 1 1 1 1
symmnumber: 1
zpe: 1261752.3 jmol-1
zpe.correction: 0.480576 hartree
zpe.thermalcorrener: 0.506040 hartree
zpe.thermalcorrenthalpy: 0.506985 hartree
zpe.thermalcorrgfe: 0.420515 hartree
zpe.sumelectzpe: -1060.198038 hartree
zpe.sumelectthermal: -1060.172573 hartree
zpe.sumelectthermalent: -1060.171629 hartree
zpe.sumelectthermalfe: -1060.258099 hartree
dipole: 0.9454 1.0211 1.9873
dipole: 2.4260
quadrupole: -136.3054 -150.5686 -153.6663
quadrupole: -2.6298 -2.7868 -5.7456
quadrupole: 10.5414 -3.7219 -6.8195 -2.6298 -2.7868 -5.7456
hfenergy: -1060.6786138 hartree
pointgroup: C01 [X(C22H31N1O2)]
dipole: 0.4934991 0.2577825 0.7752656 debye
polarizability: 266.1512055|-0.9465519|283.696753|-22.4318149|2.5237485|192.2388946 unknown
InChI: InChI=1S/C22H31NO2/c1-3-23(4-2)17-21(24)18-25-22(15-19-11-7-5-8-12-19)16-20-13-9-6-10-14-20/h5-14,21-22,24H,3-4,15-18H2,1-2H3
charge 0 multiplicity 1
56 atoms
O  -0.038211 -0.116691 -0.235764
O  0.925381 -1.828652 -2.168529
N  4.163321 -1.432159 -0.318647
C  -0.889356 0.196342 0.9394
C  1.861374 -1.137053 -1.268576
C  3.092558 -2.050757 -1.143434
C  1.192094 -0.863095 0.083415
C  -0.363362 1.45908 1.682314
C  -2.33185 0.353601 0.419593
C  5.023976 -0.508954 -1.111444
C  4.950911 -2.431922 0.453819
C  -0.567395 2.782331 0.95658
C  -3.108689 -0.944473 0.218108
C  5.69859 0.574586 -0.248838
C  4.187697 -2.991752 1.669311
C  0.06499 3.046108 -0.288484
C  -2.506521 -2.115364 -0.31597
C  -1.396089 3.788186 1.517286
C  -4.487983 -0.992678 0.550556
C  -0.128473 4.279395 -0.949038
C  -3.261593 -3.294088 -0.508378
C  -1.590483 5.024927 0.85971
C  -5.247329 -2.168438 0.354755
C  -0.955964 5.275082 -0.378112
C  -4.635734 -3.326951 -0.176591
H  -0.831156 -0.663578 1.643261
H  2.150699 -0.158735 -1.712771
H  2.765079 -2.997177 -0.67712
H  3.439272 -2.305772 -2.172132
H  1.875564 -0.283812 0.733925
H  0.926972 -1.818754 0.586989
H  -0.869055 1.49769 2.666924
H  0.713594 1.301591 1.892606
H  -2.272392 0.918871 -0.531972
H  -2.889904 1.003256 1.120136
H  5.799722 -1.074152 -1.687961
H  4.382468 -0.012431 -1.862984
H  5.291268 -3.275172 -0.199375
H  5.865754 -1.929507 0.816744
H  0.077795 -1.310418 -2.144913
H  4.934356 1.173467 0.276936
H  6.370008 0.138205 0.512579
H  6.304858 1.249791 -0.881111
H  3.902193 -2.171471 2.351254
H  3.266523 -3.523423 1.369374
H  4.820264 -3.709258 2.224534
H  0.692581 2.271051 -0.740137
H  -1.444992 -2.101877 -0.58429
H  -1.888435 3.603883 2.48089
H  -4.97139 -0.099598 0.967097
H  0.366266 4.465418 -1.909487
H  -2.776604 -4.185324 -0.923257
H  -2.232608 5.789313 1.312251
H  -6.311085 -2.1809 0.619114
H  -1.102325 6.232731 -0.890484
H  -5.220647 -4.241018 -0.328968
