program: Gaussian 09
title: 000215145
version: EM64L-G09RevD.01
frameworkgroup: C1[X(C21H27NO)]
method: RPBEPBE
basis: SDD
operation: Freq
keyword: #p
keyword: freq=noraman
keyword: PBEPBE/SDD
title: #p freq=noraman PBEPBE/SDD
converged: YES YES NO NO
title: Mulliken charges:
elementType: O N C C C C C C C C C C C C C C C C C C C C C H H H H H H H H H H H H H H H H H H H H H H H H H H H
charge: -0.300864 -0.124602 -0.348729 -0.415963 -0.379254 0.203245 0.503977 -0.573493 -0.352865 -0.397372 0.503600 -0.460435 -0.394501 -0.661387 -0.650310 -0.231175 -0.234871 -0.402344 -0.429938 -0.247003 -0.233667 -0.227925 -0.245980 0.213120 0.207921 0.236478 0.243542 0.192753 0.213171 0.203666 0.201908 0.257858 0.223207 0.257764 0.231594 0.273576 0.251821 0.205298 0.214962 0.222605 0.220642 0.217572 0.223849 0.224887 0.237899 0.230158 0.227801 0.221945 0.220800 0.225058
chargesum: 0.00000
title: Mulliken charges with hydrogens summed into heavy atoms:
elementType: O N C C C C C C C C C C C C C C C C C C C C C
charge: -0.300864 -0.124602 -0.135608 0.028437 0.057041 0.203245 0.503977 -0.156657 0.106901 0.083599 0.503600 -0.228841 -0.120925 0.010694 0.010509 -0.007325 -0.009984 -0.164445 -0.199780 -0.019202 -0.011722 -0.007125 -0.020922
polarizability: 2.71802706e+02 3.84197987e+01 2.09638019e+02 1.38467906e+01 -1.54605814e+01 2.10303531e+02
1716.lowfreq: -8.6006 -0.0004 0.0002 0.0005 4.8271 6.3009 19.2179 24.3224 28.1872
frequency: 18.4242 24.2898 27.4734 36.0158 42.7504 46.7634 57.6106 66.6796 74.2283 85.2289 115.3885 129.0732 142.5029 187.7228 198.7710 204.8474 210.4692 234.2088 258.1872 290.4610 317.1139 328.3973 347.8977 367.2670 403.5821 404.2844 414.1794 440.5075 502.6706 505.8867 544.6131 568.5597 592.9947 599.5010 617.5273 618.5263 689.3081 705.4912 708.5603 721.6149 757.7523 760.2771 773.0135 778.6730 786.6482 809.5125 836.8572 852.0939 858.4237 861.1586 900.1764 915.7694 925.7128 939.6829 975.0091 980.5296 989.5595 989.6177 991.6501 998.0464 1007.3516 1022.1192 1026.4779 1027.9006 1037.4322 1050.9676 1068.4783 1072.7119 1078.1098 1079.7480 1095.3513 1097.3270 1127.4476 1149.0421 1170.9886 1171.4962 1187.1320 1188.8831 1196.5070 1210.4466 1218.5814 1225.8503 1244.3043 1263.1069 1270.1750 1289.0933 1298.7438 1317.1165 1327.9429 1328.8464 1336.1889 1342.3820 1347.4230 1358.4911 1381.5396 1382.8227 1384.0771 1386.5342 1413.8383 1441.1784 1441.7410 1449.2616 1453.8979 1464.8177 1466.1777 1467.7114 1477.9995 1479.4451 1481.2754 1483.1191 1483.9291 1499.5277 1572.5137 1591.1580 1593.0168 1610.0115 1614.4110 2963.8495 2977.5862 2981.6691 2983.3551 2984.4578 3000.8380 3004.4832 3007.0512 3020.2766 3041.3269 3061.7489 3062.8860 3067.2960 3081.3569 3084.0978 3089.4487 3101.6888 3106.7726 3111.0661 3115.0481 3122.0158 3129.3261 3132.8867 3140.6774 3143.5978 3159.6544 3160.9844
redmass: 3.9892 3.7610 4.2040 3.8987 4.2155 3.4965 3.1292 2.9825 4.0206 3.0677 2.1413 3.7328 4.9881 2.3631 1.5103 3.3870 1.3725 1.9409 3.0084 3.1788 2.7855 2.7628 3.0684 3.8790 2.8236 2.8426 2.4832 4.2026 3.5948 3.1262 3.1062 5.9842 3.4915 3.7996 5.8607 6.3543 3.9171 1.7520 1.7802 1.9063 1.8404 1.4856 1.5501 1.1912 1.4610 3.4294 4.2584 1.2990 1.2571 1.6156 2.1851 1.4533 1.4489 2.1110 1.3861 1.3815 6.2054 5.9809 1.3230 1.3501 2.9535 3.1844 2.1981 2.1429 1.9287 3.7674 2.0201 2.1500 1.6753 1.8126 1.7113 1.7543 1.3643 1.7337 1.0518 1.0590 1.1233 1.1127 2.3745 2.8938 2.3032 1.3630 1.4940 1.3497 1.5054 1.1115 1.3099 1.3766 1.2800 1.2562 1.2989 1.2650 1.4744 1.2915 5.5522 7.6746 1.2518 1.2367 2.5334 2.1879 2.1644 1.1110 1.1066 1.0815 1.0574 1.0461 1.2621 1.6298 1.0693 1.3189 1.7124 1.1098 5.8499 5.8702 6.0525 6.0652 6.1787 1.0621 1.0596 1.0354 1.0363 1.0617 1.0649 1.0807 1.0662 1.0952 1.1010 1.0994 1.1010 1.0995 1.0992 1.0988 1.1014 1.1020 1.0878 1.0868 1.0865 1.0860 1.0910 1.0912 1.0959 1.0959 1.1015 1.1014
irintensity: 1.5415 0.1143 0.3002 0.1664 0.5984 0.0547 0.4385 0.6869 0.4034 0.8235 0.7266 0.6155 4.2165 0.4490 0.5151 2.0426 0.4895 2.1550 1.0588 0.2053 1.3704 0.1444 0.2376 13.8012 0.0108 0.0170 1.2403 9.4405 20.1870 1.9756 3.9408 3.2800 8.0575 21.7446 0.2072 0.0819 1.5020 43.4713 68.4012 2.6957 41.7491 7.5302 37.4366 7.0380 1.4794 1.7997 2.4798 1.0097 0.1795 7.4249 3.4719 2.1945 2.9241 7.6127 0.0709 0.0792 0.0476 0.0502 0.1770 0.2594 2.4786 1.8999 4.6503 9.6094 5.1906 3.0210 11.1801 5.1909 18.1010 4.6758 12.5821 12.9042 29.0554 19.6961 0.0763 0.1491 0.2417 0.6820 2.0715 28.1383 0.1170 26.1548 37.5454 20.9342 14.5830 4.6003 17.1824 2.4616 1.7479 2.9851 1.8406 5.8842 1.1406 8.6570 0.2303 0.0791 10.4047 30.3774 85.0147 7.5866 7.3140 24.8866 20.8873 0.6632 2.6728 13.0965 17.6887 9.8333 15.4891 22.6126 13.1366 7.4376 211.9771 5.5391 1.1725 14.5845 12.5714 9.9626 26.2951 23.3614 30.5234 47.4065 30.9729 7.2242 48.7309 6.6371 11.5752 11.1260 25.7579 10.6210 39.8225 44.4938 36.5537 30.0908 13.1098 9.7909 5.4450 0.1117 12.9482 12.5084 47.2669 28.4547 29.0787 30.0678
temp: 298.150 k
press: 1.00000 atm
elementType: 8 7 6 6 6 6 6 6 6 6 6 6 6 6 6 6 6 6 6 6 6 6 6 1 1 1 1 1 1 1 1 1 1 1 1 1 1 1 1 1 1 1 1 1 1 1 1 1 1 1
symmnumber: 1
zpe: 1122213.0 jmol-1
zpe.correction: 0.427428 hartree
zpe.thermalcorrener: 0.450909 hartree
zpe.thermalcorrenthalpy: 0.451853 hartree
zpe.thermalcorrgfe: 0.370549 hartree
zpe.sumelectzpe: -944.714175 hartree
zpe.sumelectthermal: -944.690694 hartree
zpe.sumelectthermalent: -944.689750 hartree
zpe.sumelectthermalfe: -944.771054 hartree
dipole: -1.9137 1.1356 3.2713
dipole: 3.9564
quadrupole: -134.1637 -130.9574 -134.9952
quadrupole: 1.6169 -0.6803 -0.3478
quadrupole: -0.7916 2.4147 -1.6231 1.6169 -0.6803 -0.3478
hfenergy: -945.141603 hartree
pointgroup: C01 [X(C21H27N1O1)]
dipole: 0.721104 0.4867046 -1.2907593 debye
polarizability: 275.7516295|-34.9299968|205.8007382|12.5914504|16.3590938|210.1918892 unknown
InChI: InChI=1S/C21H27NO/c1-3-22(4-2)21(23)20(19-15-9-6-10-16-19)17-11-14-18-12-7-5-8-13-18/h5-10,12-13,15-16,20H,3-4,11,14,17H2,1-2H3
charge 0 multiplicity 1
50 atoms
O  0.801667 1.164175 1.68158
N  1.567341 2.1988 -0.248971
C  1.135226 -0.285917 -0.276973
C  0.003701 -1.184471 0.298467
C  -1.410349 -0.646688 -0.004639
C  1.146317 1.079609 0.455319
C  2.503096 -0.969545 -0.146858
C  -2.525936 -1.572345 0.55525
C  1.589362 3.502968 0.461673
C  2.051779 2.185056 -1.648641
C  -3.92019 -1.016965 0.303817
C  3.121927 -1.560145 -1.278044
C  3.149381 -1.066768 1.1136
C  2.93666 3.767857 1.166799
C  0.938601 2.475018 -2.680377
C  4.3583 -2.2351 -1.157522
C  4.385136 -1.738955 1.235006
C  -4.451201 -0.000694 1.141475
C  -4.70386 -1.463267 -0.791426
C  4.994984 -2.326608 0.101252
C  -5.726163 0.554197 0.892856
C  -5.980301 -0.910428 -1.046231
C  -6.496412 0.101658 -0.204369
H  0.923321 -0.133007 -1.352127
H  0.121278 -2.202848 -0.123437
H  0.142239 -1.258768 1.393189
H  -1.524002 0.359886 0.440867
H  -1.552035 -0.534673 -1.099991
H  -2.356329 -1.697765 1.643042
H  -2.425814 -2.575446 0.095971
H  1.371007 4.297541 -0.276585
H  0.778547 3.488317 1.209044
H  2.844007 2.953152 -1.732126
H  2.54016 1.219639 -1.862341
H  2.628247 -1.500531 -2.257128
H  2.678903 -0.60858 1.99168
H  3.120139 2.993914 1.931028
H  3.779089 3.760804 0.450556
H  2.920908 4.753785 1.666945
H  0.149636 1.702765 -2.640581
H  0.462051 3.452574 -2.485624
H  1.355291 2.494425 -3.704471
H  4.821899 -2.687944 -2.041551
H  4.873448 -1.805841 2.214066
H  -3.859589 0.353334 1.995369
H  -4.311908 -2.25272 -1.445508
H  5.953499 -2.848915 0.197872
H  -6.120673 1.334692 1.553881
H  -6.572402 -1.271233 -1.89545
H  -7.487083 0.528806 -0.397531
