program: Gaussian 09
title: 000215111
version: EM64L-G09RevD.01
frameworkgroup: C1[X(C12H11ClO4)]
method: RPBEPBE
basis: SDD
operation: Freq
keyword: #p
keyword: freq=noraman
keyword: PBEPBE/SDD
title: #p freq=noraman PBEPBE/SDD
converged: YES YES NO NO
title: Mulliken charges:
elementType: Cl O O O O C C C C C C C C C C C C H H H H H H H H H H H
charge: -0.051919 -0.250572 -0.279409 -0.175744 -0.185533 0.123790 -0.494494 -0.554755 0.348990 0.186223 0.213779 -0.356311 -0.327799 -0.199723 -0.226208 -0.110176 -0.496965 0.253904 0.263274 0.270969 0.263257 0.289837 0.244939 0.259950 0.256225 0.247606 0.235790 0.251077
chargesum: 0.00000
title: Mulliken charges with hydrogens summed into heavy atoms:
elementType: Cl O O O O C C C C C C C C C C C C
charge: -0.051919 -0.250572 -0.279409 -0.175744 -0.185533 0.123790 0.022685 -0.020530 0.348990 0.186223 0.213779 -0.066475 -0.082859 0.060227 0.030017 -0.110176 0.237508
polarizability: 2.00435753e+02 -6.30152364e+00 1.29242488e+02 -2.28104203e-01 1.99324066e+01 1.12631726e+02
1716.lowfreq: -8.8672 0.0011 0.0016 0.0024 1.6125 5.3507 19.7001 29.0587 47.3064
frequency: 19.5876 28.9693 47.2986 65.6146 88.8924 99.7831 112.6938 131.7932 180.9326 208.1199 235.7884 247.5083 303.0858 317.4871 341.8854 362.4145 395.2161 406.5139 459.1746 502.9551 506.3558 530.8962 619.2359 623.9122 655.0930 671.1007 711.5070 732.0714 753.6560 791.5102 824.3498 839.8972 856.9932 873.5776 929.7732 951.9576 971.7666 979.5912 995.7152 1004.0212 1045.0445 1059.9086 1073.9241 1089.9967 1112.3929 1115.5955 1117.4088 1148.6089 1187.6591 1189.2826 1216.2849 1231.3914 1282.7755 1295.8130 1304.9128 1368.8271 1392.7120 1422.9431 1446.9619 1452.8716 1463.2256 1471.4008 1475.9888 1584.6966 1599.3533 1654.2967 1725.6008 3009.2543 3016.2239 3037.8969 3104.1160 3114.1404 3121.8192 3151.0084 3154.9415 3164.5917 3173.5069 3184.7346
redmass: 5.4605 4.7915 7.1929 5.2775 1.1278 5.0548 4.1544 4.4158 4.2949 4.1407 5.3432 7.8474 3.8789 7.1291 6.7502 5.2230 6.7159 2.9577 7.9265 3.1598 3.3226 3.8649 5.2814 5.1913 6.3177 6.3191 5.7022 4.3005 5.1070 3.7073 1.4141 1.3568 3.2971 3.3268 5.5119 1.4155 3.6122 1.4221 2.2498 3.9421 4.4062 2.3599 2.6884 4.8549 1.7148 1.6060 1.5063 1.4211 1.2344 1.6977 1.5850 3.5909 1.3925 1.2626 1.4103 6.5871 3.4411 1.1664 1.0804 1.0496 1.0530 1.0963 2.3541 7.7875 6.1686 10.8763 12.7092 1.0292 1.0662 1.0635 1.0971 1.1051 1.1028 1.0886 1.1053 1.0895 1.0966 1.0967
irintensity: 0.7330 0.1342 0.5122 0.0157 0.4228 5.0746 2.3238 2.1193 7.3649 4.1008 0.5711 0.5213 7.4840 5.6093 0.0457 4.1173 9.1499 0.0671 15.8301 2.3535 21.6438 5.6176 3.8093 0.5403 5.1969 13.8135 19.3057 11.9940 12.9927 11.6835 31.8197 23.3141 92.7691 9.2492 20.3726 3.7486 42.4557 2.5632 41.2493 35.7496 187.3214 48.3038 29.3686 184.6175 99.5600 63.0439 29.4574 11.2667 4.4633 21.2244 10.6137 16.6754 5.5329 0.2258 6.4702 0.3475 7.7608 12.8604 17.1180 17.7700 9.6941 13.4534 86.5018 1.9814 11.3971 161.7764 392.4738 28.9178 6.3443 12.7505 4.7315 20.4683 7.3270 4.5027 11.1452 1.1431 3.3417 0.9326
temp: 298.150 k
press: 1.00000 atm
elementType: 17 8 8 8 8 6 6 6 6 6 6 6 6 6 6 6 6 1 1 1 1 1 1 1 1 1 1 1
symmnumber: 1
zpe: 539161.8 jmol-1
zpe.correction: 0.205356 hartree
zpe.thermalcorrener: 0.221488 hartree
zpe.thermalcorrenthalpy: 0.222432 hartree
zpe.thermalcorrgfe: 0.159017 hartree
zpe.sumelectzpe: -1223.594300 hartree
zpe.sumelectthermal: -1223.578168 hartree
zpe.sumelectthermalent: -1223.577223 hartree
zpe.sumelectthermalfe: -1223.640639 hartree
dipole: 0.1686 4.6403 4.2362
dipole: 6.2853
quadrupole: -118.2386 -101.5180 -104.2200
quadrupole: 13.1022 12.4630 -1.0946
quadrupole: -10.2464 6.4742 3.7722 13.1022 12.4630 -1.0946
hfenergy: -1223.7996557 hartree
pointgroup: C01 [X(C12H11Cl1O4)]
dipole: 0.1034198 1.6859057 -1.8060932 debye
polarizability: 201.0187978|0.8088376|125.4233726|-0.6031118|-20.8707924|115.8677969 unknown
InChI: InChI=1S/C12H11ClO4/c1-16-11(15)12(7-6-10(14)17-12)8-2-4-9(13)5-3-8/h2-5H,6-7H2,1H3
charge 0 multiplicity 1
28 atoms
Cl 5.306781 -0.653509 0.192262
O  -1.444459 -1.115512 0.686172
O  -0.882306 2.337483 -0.427595
O  -3.373404 -2.410968 0.624149
O  -1.825281 1.498779 1.531646
C  -0.817302 -0.060274 -0.152226
C  -1.431452 -0.281426 -1.572326
C  -2.834631 -0.838397 -1.256942
C  0.70205 -0.209362 -0.068569
C  -2.656426 -1.563366 0.081883
C  -1.249591 1.311959 0.444607
C  1.285234 -0.982824 0.964339
C  1.537243 0.435026 -1.014748
C  2.688378 -1.123665 1.047863
C  2.940304 0.30184 -0.941988
C  3.494431 -0.478309 0.091857
C  -1.149803 3.716808 0.056876
H  -0.826725 -1.03708 -2.102566
H  -1.442003 0.646673 -2.161558
H  -3.22652 -1.536476 -2.012172
H  -3.584149 -0.036506 -1.118259
H  0.6396 -1.482807 1.690824
H  1.099927 1.055057 -1.803816
H  3.141212 -1.724131 1.841801
H  3.587434 0.795574 -1.672377
H  -2.227068 3.848337 0.251324
H  -0.807222 4.371248 -0.756181
H  -0.585261 3.904127 0.985121
