program: Gaussian 09
title: 000215113
version: EM64L-G09RevD.01
frameworkgroup: C1[X(C13H12Cl2O4)]
method: RPBEPBE
basis: SDD
operation: Freq
keyword: #p
keyword: freq=noraman
keyword: PBEPBE/SDD
title: #p freq=noraman PBEPBE/SDD
converged: YES YES NO NO
title: Mulliken charges:
elementType: Cl Cl O O O O C C C C C C C C C C C C C H H H H H H H H H H H H
charge: -0.052166 -0.044135 -0.250752 -0.276057 -0.173810 -0.179740 0.099091 -0.488293 -0.550704 0.344953 0.181895 0.229960 -0.337469 -0.364015 -0.223514 -0.197936 -0.114438 -0.184864 -0.590206 0.265936 0.254277 0.260263 0.271793 0.263278 0.291378 0.259679 0.259487 0.241026 0.262452 0.268002 0.274628
chargesum: 0.00000
title: Mulliken charges with hydrogens summed into heavy atoms:
elementType: Cl Cl O O O O C C C C C C C C C C C C C
charge: -0.052166 -0.044135 -0.250752 -0.276057 -0.173810 -0.179740 0.099091 0.031920 -0.018648 0.344953 0.181895 0.229960 -0.074190 -0.072637 0.036165 0.061550 -0.114438 0.318615 -0.047576
polarizability: 2.19896988e+02 -1.29595775e+01 1.66443660e+02 4.91838052e-01 -1.70704167e+01 1.12501468e+02
1716.lowfreq: -12.6549 -4.7644 -3.7247 -0.0018 -0.0018 -0.0008 14.1022 20.9247 40.4414
frequency: -1.0141 20.3477 40.4188 44.5977 52.4800 70.8172 100.7977 104.0559 137.4925 157.0093 192.2823 229.6301 246.9337 262.9849 278.1866 319.2240 333.9002 355.5700 392.6219 406.4798 429.1462 460.7814 502.2152 508.6002 537.3096 609.2581 621.3356 627.2208 648.2779 672.4722 712.3435 729.5780 769.8995 787.9327 821.3967 829.9582 843.6625 856.7237 902.0795 931.8188 955.7579 967.0506 982.3127 987.7713 997.0992 1003.1557 1044.0162 1055.5076 1074.0133 1078.1262 1092.1345 1101.8137 1117.9746 1172.8170 1186.9981 1189.4207 1218.7632 1219.9883 1224.6919 1282.2534 1295.8427 1298.2625 1308.2279 1363.4297 1368.8174 1393.0424 1437.3659 1446.8354 1453.0016 1472.0001 1474.6820 1583.9225 1597.7270 1653.8669 1725.3662 3002.0981 3014.8025 3040.7755 3063.6346 3082.4209 3104.1162 3126.4951 3146.9019 3153.1850 3164.9924 3174.7979 3186.2039
redmass: 8.0807 4.6910 7.3858 9.4057 9.6207 10.2381 7.8210 3.5152 4.7672 3.8921 9.7178 4.1706 9.8986 2.5843 4.3242 6.4545 5.6494 5.0488 5.4582 2.9490 3.9509 6.5410 3.4210 3.0250 3.8851 4.7415 7.0856 4.3572 6.3573 5.9711 5.9191 4.2405 3.8810 4.0282 2.0402 1.5723 1.4299 3.5277 3.4544 2.2142 1.4297 3.8495 1.3728 1.7449 2.2209 3.8715 3.3720 3.1214 2.6931 2.3297 4.6624 2.3738 1.4649 1.1757 1.8169 1.1267 1.7403 1.3126 2.4999 1.3949 1.2349 1.2214 1.3846 1.4280 6.5324 3.3665 1.1073 1.0806 1.0764 1.0905 2.3515 7.7679 6.1654 12.0900 12.7116 1.0609 1.0663 1.0643 1.0607 1.0999 1.0969 1.1022 1.1100 1.0891 1.0896 1.0966 1.0964
irintensity: 1.1261 1.9879 0.6771 1.2583 1.6549 1.9574 1.8214 4.2690 2.2530 3.7999 2.7652 1.1255 0.6491 3.5415 4.2207 2.4186 0.6930 4.3509 11.7442 0.1188 11.0104 13.9023 10.9633 14.9820 6.7665 20.8223 1.0134 4.1224 1.9305 12.8285 16.3956 13.3273 13.7554 14.7303 25.9592 12.5449 24.1415 92.9041 20.5642 9.1144 4.4006 66.2921 2.0120 10.1770 41.2858 35.2711 258.7672 66.0764 29.2420 33.0101 173.6499 181.7237 5.9929 1.4366 22.0826 1.5241 12.5770 2.8627 13.6631 4.6559 8.7359 11.3022 4.9238 1.2367 0.6494 8.1106 12.8262 17.6665 13.8961 14.5048 88.1443 2.2600 14.0886 166.9337 398.6040 16.1877 7.0390 11.4141 13.9183 11.5007 5.0330 6.4422 7.6989 0.9663 1.0899 1.1153 1.3967
temp: 298.150 k
press: 1.00000 atm
elementType: 17 17 8 8 8 8 6 6 6 6 6 6 6 6 6 6 6 6 6 1 1 1 1 1 1 1 1 1 1 1 1
symmnumber: 1
zpe: 589952.3 jmol-1
zpe.correction: 0.224701 hartree
zpe.thermalcorrener: 0.242033 hartree
zpe.thermalcorrenthalpy: 0.242977 hartree
zpe.thermalcorrgfe: 0.176745 hartree
zpe.sumelectzpe: -1722.210308 hartree
zpe.sumelectthermal: -1722.192977 hartree
zpe.sumelectthermalent: -1722.192032 hartree
zpe.sumelectthermalfe: -1722.258265 hartree
dipole: 2.7337 4.7291 -3.1107
dipole: 6.2860
quadrupole: -127.2232 -131.7918 -124.4411
quadrupole: 22.3438 -8.8173 8.0899
quadrupole: 0.5955 -3.9731 3.3776 22.3438 -8.8173 8.0899
hfenergy: -1722.4350094 hartree
pointgroup: C01[X(C13H12Cl2O4)]
dipole: 0.3583452 1.9383456 -1.4935306 debye
polarizability: 221.7083431|8.9075769|159.4483989|6.0853816|-22.0562767|117.6853737 unknown
InChI: InChI=1S/C13H12Cl2O4/c14-7-8-18-12(17)13(6-5-11(16)19-13)9-1-3-10(15)4-2-9/h1-4H,5-8H2
charge 0 multiplicity 1
31 atoms
Cl -5.019773 -2.020206 0.252467
Cl -1.695327 3.948674 -0.982694
O  1.737404 -1.400379 0.640853
O  0.715468 2.015082 -0.190571
O  3.833385 -2.374467 0.400725
O  1.55299 1.136299 1.798745
C  0.916579 -0.393208 -0.080471
C  1.494881 -0.395418 -1.532745
C  2.978658 -0.754854 -1.316499
C  -0.559732 -0.79183 0.01642
C  2.972893 -1.606232 -0.042045
C  1.126755 0.966324 0.643304
C  -1.54132 -0.055114 -0.693669
C  -0.951599 -1.896426 0.810324
C  -2.90109 -0.426146 -0.62621
C  -2.310074 -2.277469 0.882941
C  -3.263859 -1.53638 0.160835
C  0.659491 3.357727 0.444957
C  0.107838 4.325833 -0.581541
H  1.335675 0.56796 -2.037006
H  0.985696 -1.187641 -2.107652
H  3.606278 0.137948 -1.133448
H  3.434638 -1.320046 -2.143539
H  -1.258758 0.822324 -1.283721
H  -0.193859 -2.455704 1.364474
H  -3.660065 0.142432 -1.170661
H  -2.616263 -3.131963 1.49304
H  1.68407 3.65675 0.741059
H  0.035847 3.302711 1.353937
H  0.116211 5.353996 -0.189456
H  0.64666 4.269421 -1.538356
