program: Gaussian 09
title: 000215165
version: EM64L-G09RevD.01
frameworkgroup: C1[X(C24H33NO2)]
method: RPBEPBE
basis: SDD
operation: Freq
keyword: #p
keyword: freq=noraman
keyword: PBEPBE/SDD
title: #p freq=noraman PBEPBE/SDD
converged: YES YES NO NO
title: Mulliken charges:
elementType: O O N C C C C C C C C C C C C C C C C C C C C C C C C H H H H H H H H H H H H H H H H H H H H H H H H H H H H H H H H H
charge: -0.335713 -0.445710 -0.331935 -0.037743 -0.408135 -0.450011 -0.394528 -0.396369 -0.384371 -0.416252 -0.127221 -0.296023 0.040083 -0.587236 -0.595685 0.483571 0.508296 -0.388438 -0.372346 -0.464760 -0.451602 -0.225653 -0.238960 -0.220352 -0.222542 -0.263850 -0.246008 0.201351 0.213976 0.178007 0.183214 0.216268 0.197894 0.193255 0.194432 0.198327 0.187800 0.199267 0.231119 0.225389 0.220413 0.208277 0.207516 0.227599 0.208827 0.250740 0.209232 0.215248 0.230251 0.344963 0.276025 0.237513 0.230078 0.227542 0.225760 0.226516 0.223414 0.225069 0.226268 0.227947
chargesum: 0.00000
title: Mulliken charges with hydrogens summed into heavy atoms:
elementType: O O N C C C C C C C C C C C C C C C C C C C C C C C C
charge: -0.335713 -0.100748 -0.100816 0.163607 -0.016152 -0.050529 -0.003379 -0.003610 0.002696 0.029550 0.081057 0.139091 0.248910 -0.127264 -0.150187 0.483571 0.508296 -0.112412 -0.134833 -0.234681 -0.224061 0.000106 -0.012444 0.003062 0.002526 -0.037583 -0.018061
polarizability: 3.27938654e+02 4.56298280e+00 2.62340987e+02 -1.44565725e+01 -1.18804082e+01 2.07740350e+02
1716.lowfreq: -13.4982 -4.9509 0.0001 0.0004 0.0007 1.7727 7.2287 10.5926 18.3479
frequency: -6.1878 10.0315 17.5290 25.8068 37.0247 40.1525 42.4697 54.3852 72.4181 87.4166 104.3382 108.7443 128.4670 156.7779 182.2371 193.2768 214.8109 228.6284 239.2447 256.4837 267.2950 283.1873 307.2320 325.5257 333.2973 385.2825 405.3490 406.8008 409.7586 418.7483 435.4862 437.5877 456.4259 464.4309 475.9858 486.2454 510.8717 563.1591 569.0036 594.4867 617.9374 618.4302 661.5037 667.9372 706.6527 710.4726 740.7357 751.5069 775.3174 777.7823 790.3190 805.9671 826.9299 840.1640 841.3352 856.2300 859.5449 878.2736 881.7800 892.5905 911.9493 915.6916 918.4157 929.0383 946.1530 961.2601 969.6402 979.1014 981.0632 990.2016 991.4231 992.5057 995.9045 998.0576 1006.5383 1027.5002 1029.5661 1041.0213 1043.8901 1051.8201 1069.7833 1077.3382 1080.8731 1082.6189 1092.4132 1110.5463 1112.4790 1139.7386 1147.0034 1169.4934 1170.9789 1183.0494 1186.0430 1187.5796 1195.5527 1198.4599 1204.4376 1213.7710 1215.1058 1221.9478 1241.7686 1248.3664 1250.3896 1255.4319 1259.2885 1301.6257 1304.5925 1308.5142 1322.7111 1326.8275 1329.6197 1332.0273 1334.6528 1339.6326 1341.2877 1342.8122 1353.8455 1362.2490 1363.9755 1372.6345 1378.7382 1381.0921 1384.1016 1435.7478 1438.0514 1448.4840 1451.6080 1453.2356 1459.9031 1461.4492 1462.3993 1463.3833 1471.0311 1477.4084 1479.3156 1482.8480 1483.7688 1590.2074 1590.3027 1613.2647 1614.8045 2925.1491 2948.6709 2950.2170 2957.0508 2962.5040 2963.2518 2965.6211 2966.2415 2967.0564 2974.4029 2993.5808 3020.7225 3021.7755 3023.1002 3027.4899 3028.1685 3029.2219 3034.4703 3039.6980 3042.4674 3047.2325 3111.9751 3112.6737 3123.2181 3123.6443 3136.2506 3136.7204 3146.9137 3152.2455 3162.3169 3163.1350 3414.5600 3529.8558
redmass: 4.3940 4.1330 4.2675 3.6640 3.9161 4.5607 4.3230 4.3272 3.9414 4.0006 4.4182 4.1716 4.3131 2.8855 3.7413 3.5543 2.3935 1.8485 3.7461 4.8260 3.3705 4.4323 3.3359 1.8039 2.3346 2.4847 2.8398 2.6190 2.3388 1.3304 2.3919 2.3906 2.7194 2.2609 2.7300 4.4425 3.3768 2.2833 4.0233 2.9310 6.1972 6.0969 2.7316 1.7224 1.9519 1.8269 2.0441 1.8132 2.4823 1.8656 1.8968 3.3146 3.0635 2.5206 2.3105 1.2571 1.2538 1.7357 1.8466 1.5121 1.9777 1.7006 1.7883 1.6168 2.4641 2.9320 2.1814 1.3953 1.5091 5.0426 3.1550 1.5837 1.8190 1.6841 2.6843 2.1806 2.1368 1.7858 2.4034 1.1021 1.4249 1.6344 1.9626 1.8190 2.2588 2.4367 2.1603 3.4120 1.7962 1.0589 1.0610 1.2956 1.1234 1.2134 1.4202 1.4455 1.4918 1.9947 1.6037 1.5180 1.1990 1.2597 1.3146 1.2851 1.3511 1.2555 1.2909 1.4701 1.2425 1.3570 1.2604 1.3149 1.3933 1.4594 1.4527 1.4577 1.4297 1.3982 1.5076 1.4959 2.0622 4.1109 2.4725 1.6556 1.8581 1.2836 1.2112 1.2227 1.0964 1.0911 1.0903 1.0916 1.0825 1.1243 1.0954 2.2172 2.1976 5.9906 6.0203 6.1477 6.1533 1.0675 1.0724 1.0655 1.0683 1.0598 1.0645 1.0710 1.0609 1.0651 1.0756 1.0609 1.0872 1.0965 1.0960 1.0976 1.0992 1.1059 1.0977 1.0918 1.1025 1.0998 1.0873 1.0864 1.0859 1.0866 1.0916 1.0927 1.0952 1.0954 1.1013 1.0997 1.0734 1.0651
irintensity: 0.0329 0.1755 0.0215 0.1715 0.1435 0.0347 0.2203 0.1261 0.4438 0.4237 0.6944 0.3012 1.5110 6.2243 6.9481 1.9181 2.7900 0.6955 2.1336 8.6317 0.9933 3.1162 0.9146 1.3133 2.2041 0.6209 0.3116 5.5996 1.1615 105.1693 2.4313 14.2014 2.0025 2.5394 13.0831 5.1299 34.7482 1.3587 2.8891 9.8527 0.6545 0.5211 15.1064 64.8228 33.8109 55.6895 24.7386 55.7480 4.6372 8.5345 2.3001 2.0853 1.3780 4.9540 17.3015 0.3801 0.0303 7.0581 6.2847 13.2277 14.6921 0.7803 11.7609 2.8955 32.2393 12.2091 7.3021 0.4044 0.4211 0.6383 0.9102 6.9605 5.6222 23.1951 78.6925 10.9589 15.3131 11.1442 26.8358 1.5115 3.2773 4.7485 54.0329 25.6637 13.0229 0.6559 28.1007 53.6577 20.4597 1.9345 0.1177 3.5068 1.7818 0.4583 8.4948 2.3992 7.3644 0.9176 10.9634 4.2066 9.6460 6.4626 2.6549 2.2524 0.6485 0.3742 0.6174 3.2661 14.4474 3.5515 3.6691 13.2330 0.5615 0.3247 0.6198 8.8732 2.4684 3.8900 20.0916 18.3992 1.3786 0.7689 1.8789 1.1039 6.7028 20.3270 16.1423 10.4399 5.8095 20.2805 4.1084 12.3680 23.5653 6.6764 3.5806 42.4940 13.7868 2.1375 0.0522 15.3477 8.4876 57.9587 8.8733 18.3835 21.9571 6.8849 12.3877 54.0867 63.2234 35.4972 62.9261 30.9256 10.1556 17.6029 88.8113 89.4616 18.5837 28.5948 10.0080 37.7188 174.2348 16.4134 9.9095 8.7969 0.0955 1.5505 16.9295 36.7372 39.4591 28.5748 26.6381 14.8221 1.7297 28.3725
temp: 298.150 k
press: 1.00000 atm
elementType: 8 8 7 6 6 6 6 6 6 6 6 6 6 6 6 6 6 6 6 6 6 6 6 6 6 6 6 1 1 1 1 1 1 1 1 1 1 1 1 1 1 1 1 1 1 1 1 1 1 1 1 1 1 1 1 1 1 1 1 1
symmnumber: 1
zpe: 1360708.9 jmol-1
zpe.correction: 0.518267 hartree
zpe.thermalcorrener: 0.543927 hartree
zpe.thermalcorrenthalpy: 0.544871 hartree
zpe.thermalcorrgfe: 0.459116 hartree
zpe.sumelectzpe: -1137.483071 hartree
zpe.sumelectthermal: -1137.457411 hartree
zpe.sumelectthermalent: -1137.456467 hartree
zpe.sumelectthermalfe: -1137.542222 hartree
dipole: 0.7422 1.4964 -0.4169
dipole: 1.7216
quadrupole: -146.6157 -169.9942 -160.1544
quadrupole: -10.2137 -1.6334 -4.8886
quadrupole: 12.3057 -11.0728 -1.2330 -10.2137 -1.6334 -4.8886
hfenergy: -1138.001338 hartree
pointgroup: C01 [X(C24H33N1O2)]
dipole: 0.3296167 -0.571477 0.153406 debye
polarizability: 327.7346536|-0.2687807|262.5892165|17.1719347|-9.3233158|207.6961207 unknown
InChI: InChI=1S/C24H33NO2/c26-23(18-25-22-14-8-3-9-15-22)19-27-24(16-20-10-4-1-5-11-20)17-21-12-6-2-7-13-21/h1-2,4-7,10-13,22-26H,3,8-9,14-19H2
charge 0 multiplicity 1
60 atoms
O  -0.926322 0.513274 0.81885
O  -0.975429 3.343178 1.213415
N  2.494518 1.853271 1.084543
C  3.463267 1.343726 0.080454
C  4.080857 2.43629 -0.840449
C  4.584749 0.55783 0.799604
C  5.081591 1.82798 -1.853474
C  5.593789 -0.050053 -0.204224
C  6.19567 1.033654 -1.131048
C  1.262858 2.485454 0.562671
C  0.157511 2.507832 1.647185
C  -0.328351 1.105838 2.034012
C  -1.751804 -0.697131 1.087703
C  -1.563518 -1.66691 -0.100698
C  -3.231088 -0.297535 1.340747
C  -0.290348 -2.503969 -0.049921
C  -4.057156 0.107809 0.123288
C  0.987874 -1.908613 0.127995
C  -3.567057 1.015141 -0.854555
C  -0.361677 -3.913861 -0.194593
C  -5.371268 -0.402533 -0.037275
C  2.154884 -2.704075 0.16345
C  -4.367987 1.401217 -1.951277
C  0.805485 -4.711462 -0.164025
C  -6.178048 -0.016253 -1.132198
C  2.070893 -4.10831 0.015761
C  -5.679146 0.890342 -2.094522
H  2.907486 0.632306 -0.567476
H  3.277688 2.979134 -1.376121
H  4.606276 3.179544 -0.202437
H  5.123609 1.247945 1.484723
H  4.126962 -0.228175 1.429567
H  5.522371 2.626791 -2.480961
H  4.53641 1.147099 -2.539859
H  5.076132 -0.810707 -0.825824
H  6.398854 -0.578793 0.342066
H  6.806764 1.733569 -0.524018
H  6.877117 0.569117 -1.869898
H  2.966663 2.452759 1.777779
H  1.394542 3.531403 0.205139
H  0.906145 1.884653 -0.295635
H  0.541486 3.011269 2.554565
H  -1.089709 1.187372 2.837063
H  0.52384 0.485735 2.37534
H  -1.364995 -1.172143 2.014125
H  -1.593536 -1.06289 -1.027696
H  -2.442054 -2.338479 -0.143096
H  -3.728499 -1.151038 1.842408
H  -3.224958 0.5313 2.079178
H  -1.508624 2.796874 0.577952
H  1.058747 -0.821557 0.239799
H  -2.545234 1.398401 -0.759847
H  -1.340127 -4.390916 -0.334357
H  -5.768127 -1.106813 0.705147
H  3.131863 -2.226944 0.305016
H  -3.969905 2.101428 -2.694802
H  0.726643 -5.798742 -0.278989
H  -7.191094 -0.422295 -1.23332
H  2.977843 -4.723084 0.040753
H  -6.301423 1.193143 -2.944102
